{"text_format":"3","workbook":"xlsx","n_sheets":8,"sheets":["info","spisak","grupe","plasman","32","partije","plasman-bodovi","razigravanje"],"not_rendered":{"macros":1,"external_links":2,"defined_names":14,"comments":1},"read":"whole","date_system":"1900"}

{"sheet":"info","index":0,"n_rows":8,"n_cols":3,"rows_kept":8,"merged":[[2,2,2,3],[4,0,4,1],[5,0,5,1],[6,0,6,1],[6,2,6,3],[9,0,23,3],[24,0,32,3]]}
["                               Stonoteniski savez Srbije"]
[]
["takmičenje:",null,"Otvoreno prvenstvo RSTSN"]
["kategorija:",null,"mlađi kadeti"]
["datum:","datum:","02.2.2019."]
["mesto:","mesto:","Niš"]
["organizator:","organizator:","RSTSN"]
["vrhovni sudija, delegat STSS:",null,"Dušan Jovičić"]

{"sheet":"spisak","index":1,"n_rows":116,"n_cols":11,"rows_kept":116}
[{"$f":"info!C3","v":"Otvoreno prvenstvo RSTSN"},{"$nulls":4},{"$f":"info!C4","v":"mlađi kadeti"}]
[]
[null,"prezime i ime","klub","rang \nlista","žreb","grupa"]
[1,"Kalinić Ilija","Ugrinovci",43,null,{"v":32,"d":"3-2"},1]
[2,"Zaharijev  Nikola","Mladost Bosilegrad",0,null,{"v":13,"d":"1-3"},64]
[3,"Jović Aleksandar","Dubočica Leskovac",0,null,{"v":23,"d":"2-3"},32]
[4,"Ilič Gavrilo","Dubočica Leskovac",0,null,{"v":123,"d":"12-3"},33]
[5,"Marković Jovan","Vojvodina  Novi Sad",24,null,{"v":122,"d":"12-2"},16]
[6,"Miljuš Luka","Vojvodina  Novi Sad",13,null,{"v":131,"d":"13-1"},17]
[7,"Jelikić Dimitrije","Crvena Zvezda Beograd",5,null,{"v":51,"d":"5-1"},48]
[8,"Mladenović Ognjen","Prva Petoletka",58,null,{"v":82,"d":"8-2"},49]
[9,"Velinović Miloš","Belo Polje",0,null,{"v":33,"d":"3-3"},8]
[10,"Pavković Đorđe","Ozren Sokobanja",0,null,{"v":143,"d":"14-3"},9]
[11,"Dragin Saša","Borac Čačak",51,null,{"v":72,"d":"7-2"},24]
[12,"Dragin Luka","Borac Čačak",0,null,{"v":43,"d":"4-3"},25]
[13,"Putnik Dario","Milenijum",39,null,{"v":22,"d":"2-2"},40]
[14,"Radonjić Stefan","Milenijum",12,null,{"v":121,"d":"12-1"},41]
[15,"Šepa Matija","Stak Zemun",2,null,{"v":21,"d":"2-1"},56]
[16,"Pavlović Dimitrije","Stak Zemun",7,null,{"v":71,"d":"7-1"},57]
[17,"Pavlović Dušan","Stak Zemun",4,null,{"v":41,"d":"4-1"}]
[18,"Stefanović Vanja","Stak Zemun",3,null,{"v":31,"d":"3-1"}]
[19,"Ninković Uroš","Stak Zemun",9,null,{"v":91,"d":"9-1"}]
[20,"Bošković Marko","Stak Zemun",8,null,{"v":81,"d":"8-1"}]
[21,"Jovanović Đurađ","Sinđelić Beograd",18,null,{"v":92,"d":"9-2"}]
[22,"Ivančev Đorđe","Sinđelić Beograd",36,null,{"v":12,"d":"1-2"}]
[23,"Kalinčević Vladimir","Sinđelić Beograd",45,null,{"v":52,"d":"5-2"}]
[24,"Miovčić Mihailo","Sinđelić Beograd",44,null,{"v":42,"d":"4-2"}]
[25,"Varga Danijel","Temerin",6,null,{"v":61,"d":"6-1"}]
[26,"Gerginov Vanja","Novi Sad",14,null,{"v":141,"d":"14-1"}]
[27,"Stefanović Luka","Novi Sad",20,null,{"v":112,"d":"11-2"}]
[28,"Rajić Borislav","Novi Sad",10,null,{"v":101,"d":"10-1"}]
[29,"Rajić Dalibor","Novi Sad",15,null,{"v":151,"d":"15-1"}]
[30,"Sabadoš Matej","Rusin",33,null,{"v":142,"d":"14-2"}]
[31,"Živadinović Dimitrije","Železničar Niš",0,null,{"v":73,"d":"7-3"}]
[32,"Konstantinov Marko","Vršac",19,null,{"v":102,"d":"10-2"}]
[33,"Preslav Nikolov","Bdinci Bugarska",0,null,{"v":63,"d":"6-3"}]
[34,"Aleksandar Todorov","Bdinci Bugarska",0,null,{"v":153,"d":"15-3"}]
[35,"Ivailo Bojanov","Bdinci Bugarska",0,null,{"v":103,"d":"10-3"}]
[36,"Janićijević Ognjen","Lala",0,null,{"v":53,"d":"5-3"}]
[37,"Lazić Nemanja","Lala",0,null,{"v":93,"d":"9-3"}]
[38,"Marinković Vasilije","Barajevo",11,null,{"v":111,"d":"11-1"}]
[39,"Vičević Luka","Barajevo",0,null,{"v":163,"d":"16-3"}]
[40,"Marton Filip","Doža",49,null,{"v":62,"d":"6-2"}]
[41,"Ilić Bogdan","Napad",1,null,{"v":11,"d":"1-1"}]
[42,"Orolić Đorđe","Napad",0,null,{"v":113,"d":"11-3"}]
[43,"Pucarević Pavle","Hajduk Veljko",25,null,{"v":132,"d":"13-2"}]
[44,"Stojilković Aleksej","Železničar Niš",0,null,{"v":133,"d":"13-3"}]
[45,"Titovski Nenad","Skoplje",0,null,{"v":83,"d":"8-3"}]
[46,"Jozić Marino","Spartak",16,null,{"v":161,"d":"16-1"}]
[47,"Vasić Bogdan","Stoni",35,null,{"v":162,"d":"16-2"}]
[48,"Paunović Petar","Stoni",34,null,{"v":152,"d":"15-2"}]
{"$rows_empty":64}
[{"$nulls":10}," "]

{"sheet":"grupe","index":2,"n_rows":463,"n_cols":20,"rows_kept":463,"merged":[[3,4,3,5],[3,6,3,7],[3,8,3,9],[3,10,3,11],[4,6,4,7],[4,8,4,9],[4,10,4,11],[5,4,5,5],[5,8,5,9],[5,10,5,11],[6,4,6,5],[6,6,6,7],[6,10,6,11],[7,4,7,5],[7,6,7,7],[7,8,7,9],[8,4,8,5],[8,6,8,7],[8,8,8,9],[8,10,8,11],[9,6,9,7],[9,8,9,9],[9,10,9,11],[10,6,10,7],[10,8,10,9],[10,10,10,11],[11,6,11,7],[11,8,11,9],[11,10,11,11],[12,6,12,7],[12,8,12,9],[12,10,12,11],[13,6,13,7],[13,8,13,9],[13,10,13,11],[14,6,14,7],[14,8,14,9],[14,10,14,11],[17,4,17,5],[17,6,17,7],[17,8,17,9],[17,10,17,11],[18,6,18,7],[18,8,18,9],[18,10,18,11],[19,4,19,5],[19,8,19,9],[19,10,19,11],[20,4,20,5],[20,6,20,7],[20,10,20,11],[21,4,21,5],[21,6,21,7],[21,8,21,9],[22,4,22,5],[22,6,22,7],[22,8,22,9],[22,10,22,11],[23,6,23,7],[23,8,23,9],[23,10,23,11],[24,6,24,7],[24,8,24,9],[24,10,24,11],[25,6,25,7],[25,8,25,9],[25,10,25,11],[26,6,26,7],[26,8,26,9],[26,10,26,11],[27,6,27,7],[27,8,27,9],[27,10,27,11],[28,6,28,7],[28,8,28,9],[28,10,28,11],[31,4,31,5],[31,6,31,7],[31,8,31,9],[31,10,31,11],[32,6,32,7],[32,8,32,9],[32,10,32,11],[33,4,33,5],[33,8,33,9],[33,10,33,11],[34,4,34,5],[34,6,34,7],[34,10,34,11],[35,4,35,5],[35,6,35,7],[35,8,35,9],[36,4,36,5],[36,6,36,7],[36,8,36,9],[36,10,36,11],[37,6,37,7],[37,8,37,9],[37,10,37,11],[38,6,38,7],[38,8,38,9],[38,10,38,11],[39,6,39,7],[39,8,39,9],[39,10,39,11],[40,6,40,7],[40,8,40,9],[40,10,40,11],[41,6,41,7],[41,8,41,9],[41,10,41,11],[42,6,42,7],[42,8,42,9],[42,10,42,11],[45,6,45,7],[45,8,45,9],[45,10,45,11],[46,6,46,7],[46,8,46,9],[46,10,46,11],[47,4,47,5],[47,8,47,9],[47,10,47,11],[48,4,48,5],[48,6,48,7],[48,10,48,11],[49,6,49,7],[49,8,49,9],[50,4,50,5],[50,6,50,7],[50,8,50,9],[50,10,50,11],[51,6,51,7],[51,8,51,9],[51,10,51,11],[52,6,52,7],[52,8,52,9],[52,10,52,11],[53,8,53,9],[53,10,53,11],[54,6,54,7],[54,8,54,9],[54,10,54,11],[55,6,55,7],[55,8,55,9],[55,10,55,11],[56,6,56,7],[56,8,56,9],[56,10,56,11],[59,4,59,5],[59,6,59,7],[59,8,59,9],[59,10,59,11],[60,6,60,7],[60,8,60,9],[60,10,60,11],[61,4,61,5],[61,8,61,9],[61,10,61,11],[62,4,62,5],[62,6,62,7],[62,10,62,11],[63,4,63,5],[63,6,63,7],[63,8,63,9],[64,0,64,1],[64,4,64,5],[64,6,64,7],[64,8,64,9],[64,10,64,11],[65,6,65,7],[65,8,65,9],[65,10,65,11],[66,6,66,7],[66,8,66,9],[66,10,66,11],[67,6,67,7],[67,8,67,9],[68,6,68,7],[68,8,68,9],[68,10,68,11],[69,6,69,7],[69,8,69,9],[69,10,69,11],[70,6,70,7],[70,8,70,9],[70,10,70,11],[73,4,73,5],[73,6,73,7],[73,8,73,9],[73,10,73,11],[74,6,74,7],[74,8,74,9],[74,10,74,11],[75,4,75,5],[75,8,75,9],[75,10,75,11],[76,4,76,5],[76,6,76,7],[76,10,76,11],[77,4,77,5],[77,6,77,7],[77,8,77,9],[78,0,78,1],[78,4,78,5],[78,6,78,7],[78,10,78,11],[79,6,79,7],[80,6,80,7],[80,8,80,9],[80,10,80,11],[81,6,81,7],[81,8,81,9],[82,8,82,9],[82,10,82,11],[83,6,83,7],[83,8,83,9],[83,10,83,11],[84,6,84,7],[84,8,84,9],[87,4,87,5],[87,6,87,7],[87,8,87,9],[87,10,87,11],[88,6,88,7],[88,8,88,9],[88,10,88,11],[89,4,89,5],[89,8,89,9],[90,4,90,5],[90,6,90,7],[91,4,91,5],[92,0,92,1],[92,4,92,5],[92,6,92,7],[93,6,93,7],[93,10,93,11],[94,6,94,7],[94,8,94,9],[94,10,94,11],[95,8,95,9],[96,6,96,7],[96,8,96,9],[97,6,97,7],[97,8,97,9],[98,6,98,7],[98,8,98,9],[101,4,101,5],[101,6,101,7],[101,10,101,11],[102,6,102,7],[102,8,102,9],[102,10,102,11],[103,4,103,5],[103,8,103,9],[103,10,103,11],[104,10,104,11],[105,4,105,5],[105,6,105,7],[105,8,105,9],[106,0,106,1],[106,4,106,5],[106,6,106,7],[106,8,106,9],[106,10,106,11],[107,6,107,7],[107,8,107,9],[107,10,107,11],[108,6,108,7],[108,8,108,9],[108,10,108,11],[109,6,109,7],[109,8,109,9],[109,10,109,11],[110,6,110,7],[110,8,110,9],[110,10,110,11],[111,6,111,7],[111,8,111,9],[111,10,111,11],[112,6,112,7],[112,8,112,9],[112,10,112,11],[115,6,115,7],[115,8,115,9],[115,10,115,11],[116,6,116,7],[116,8,116,9],[116,10,116,11],[117,10,117,11],[118,4,118,5],[118,6,118,7],[118,10,118,11],[119,4,119,5],[119,6,119,7],[119,8,119,9],[120,0,120,1],[120,6,120,7],[120,8,120,9],[120,10,120,11],[121,6,121,7],[121,8,121,9],[121,10,121,11],[122,6,122,7],[122,8,122,9],[122,10,122,11],[123,6,123,7],[123,8,123,9],[123,10,123,11],[124,6,124,7],[124,8,124,9],[124,10,124,11],[125,6,125,7],[125,8,125,9],[125,10,125,11],[126,6,126,7],[126,8,126,9],[126,10,126,11],[129,4,129,5],[129,6,129,7],[129,8,129,9],[129,10,129,11],[130,6,130,7],[130,8,130,9],[130,10,130,11],[131,8,131,9],[131,10,131,11],[132,10,132,11],[133,4,133,5],[133,6,133,7],[133,8,133,9],[134,0,134,1],[134,4,134,5],[134,6,134,7],[134,8,134,9],[134,10,134,11],[135,8,135,9],[135,10,135,11],[136,10,136,11],[137,8,137,9],[137,10,137,11],[138,8,138,9],[138,10,138,11],[139,6,139,7],[140,6,140,7],[140,8,140,9],[143,4,143,5],[143,6,143,7],[143,10,143,11],[144,6,144,7],[144,8,144,9],[145,4,145,5],[145,8,145,9],[145,10,145,11],[146,4,146,5],[146,6,146,7],[146,10,146,11],[147,4,147,5],[147,6,147,7],[148,0,148,1],[148,4,148,5],[148,6,148,7],[148,8,148,9],[148,10,148,11],[149,8,149,9],[150,6,150,7],[150,8,150,9],[150,10,150,11],[151,6,151,7],[151,8,151,9],[151,10,151,11],[152,6,152,7],[152,8,152,9],[152,10,152,11],[153,6,153,7],[153,8,153,9],[153,10,153,11],[154,6,154,7],[154,8,154,9],[154,10,154,11],[157,4,157,5],[157,6,157,7],[157,8,157,9],[157,10,157,11],[158,6,158,7],[158,8,158,9],[158,10,158,11],[159,4,159,5],[159,8,159,9],[159,10,159,11],[160,4,160,5],[160,6,160,7],[160,10,160,11],[161,4,161,5],[161,6,161,7],[161,8,161,9],[162,0,162,1],[162,4,162,5],[162,6,162,7],[162,8,162,9],[162,10,162,11],[163,6,163,7],[163,8,163,9],[163,10,163,11],[164,6,164,7],[164,8,164,9],[164,10,164,11],[165,6,165,7],[165,8,165,9],[165,10,165,11],[166,6,166,7],[166,8,166,9],[166,10,166,11],[167,6,167,7],[167,8,167,9],[167,10,167,11],[168,6,168,7],[168,8,168,9],[168,10,168,11],[171,4,171,5],[171,6,171,7],[171,8,171,9],[171,10,171,11],[172,6,172,7],[172,8,172,9],[172,10,172,11],[173,4,173,5],[173,8,173,9],[173,10,173,11],[174,4,174,5],[174,6,174,7],[174,10,174,11],[175,4,175,5],[175,6,175,7],[175,8,175,9],[176,6,176,7],[176,8,176,9],[177,6,177,7],[177,8,177,9],[177,10,177,11],[178,6,178,7],[178,8,178,9],[178,10,178,11],[179,6,179,7],[179,8,179,9],[179,10,179,11],[180,6,180,7],[180,8,180,9],[180,10,180,11],[181,6,181,7],[181,8,181,9],[181,10,181,11],[182,6,182,7],[182,8,182,9],[182,10,182,11],[186,10,186,11],[189,4,189,5],[189,6,189,7],[189,8,189,9],[190,0,190,1],[190,6,190,7],[190,8,190,9],[191,6,191,7],[191,10,191,11],[192,6,192,7],[192,8,192,9],[192,10,192,11],[193,6,193,7],[193,8,193,9],[193,10,193,11],[194,6,194,7],[194,8,194,9],[194,10,194,11],[195,6,195,7],[195,8,195,9],[195,10,195,11],[196,6,196,7],[196,8,196,9],[196,10,196,11],[199,4,199,5],[199,6,199,7],[199,8,199,9],[200,8,200,9],[201,8,201,9],[201,10,201,11],[203,6,203,7],[203,8,203,9],[204,0,204,1],[206,6,206,7],[206,8,206,9],[208,6,208,7],[210,8,210,9],[217,4,217,5],[217,6,217,7],[218,0,218,1],[218,4,218,5],[218,8,218,9],[220,6,220,7],[221,6,221,7],[221,8,221,9],[221,10,221,11],[222,6,222,7],[223,6,223,7],[223,10,223,11],[224,6,224,7],[224,8,224,9],[224,10,224,11],[227,4,227,5],[227,6,227,7],[227,8,227,9],[227,10,227,11],[228,8,228,9],[228,10,228,11],[229,4,229,5],[229,8,229,9],[229,10,229,11],[230,4,230,5],[230,6,230,7],[230,10,230,11],[231,4,231,5],[231,6,231,7],[231,8,231,9],[232,0,232,1],[232,6,232,7],[232,8,232,9],[233,6,233,7],[233,8,233,9],[233,10,233,11],[234,8,234,9],[234,10,234,11],[235,6,235,7],[235,8,235,9],[235,10,235,11],[236,6,236,7],[236,8,236,9],[236,10,236,11],[237,6,237,7],[237,8,237,9],[238,6,238,7],[238,8,238,9],[238,10,238,11],[241,4,241,5],[241,6,241,7],[241,8,241,9],[241,10,241,11],[242,6,242,7],[242,8,242,9],[243,4,243,5],[243,8,243,9],[243,10,243,11],[244,4,244,5],[244,6,244,7],[244,10,244,11],[245,4,245,5],[245,6,245,7],[245,8,245,9],[246,4,246,5],[246,6,246,7],[246,8,246,9],[246,10,246,11],[247,6,247,7],[247,8,247,9],[247,10,247,11],[248,6,248,7],[248,8,248,9],[248,10,248,11],[249,6,249,7],[249,8,249,9],[250,6,250,7],[250,8,250,9],[250,10,250,11],[251,6,251,7],[251,8,251,9],[252,6,252,7],[252,8,252,9],[255,4,255,5],[257,4,257,5],[259,8,259,9],[260,0,260,1],[260,6,260,7],[261,6,261,7],[261,8,261,9],[261,10,261,11],[263,6,263,7],[263,8,263,9],[264,6,264,7],[265,6,265,7],[265,8,265,9],[265,10,265,11],[266,6,266,7],[266,8,266,9],[269,6,269,7],[269,8,269,9],[270,8,270,9],[271,10,271,11],[272,4,272,5],[272,6,272,7],[273,6,273,7],[273,8,273,9],[274,4,274,5],[274,6,274,7],[274,8,274,9],[275,6,275,7],[275,8,275,9],[275,10,275,11],[276,6,276,7],[276,8,276,9],[277,6,277,7],[277,8,277,9],[278,6,278,7],[278,8,278,9],[278,10,278,11],[279,6,279,7],[279,8,279,9],[280,8,280,9],[283,6,283,7],[283,10,283,11],[284,6,284,7],[284,8,284,9],[285,8,285,9],[285,10,285,11],[286,4,286,5],[286,10,286,11],[287,6,287,7],[287,8,287,9],[288,4,288,5],[288,6,288,7],[288,8,288,9],[288,10,288,11],[290,10,290,11],[291,8,291,9],[291,10,291,11],[292,8,292,9],[293,8,293,9],[293,10,293,11],[297,4,297,5],[297,6,297,7],[298,6,298,7],[298,8,298,9],[299,4,299,5],[300,4,300,5],[300,6,300,7],[301,4,301,5],[301,6,301,7],[302,4,302,5],[302,6,302,7],[303,6,303,7],[305,6,305,7],[306,6,306,7],[307,6,307,7],[308,6,308,7],[311,4,311,5],[311,6,311,7],[312,6,312,7],[313,4,313,5],[313,8,313,9],[314,4,314,5],[314,6,314,7],[315,4,315,5],[315,6,315,7],[315,8,315,9],[316,4,316,5],[316,6,316,7],[317,6,317,7],[317,8,317,9],[318,6,318,7],[318,8,318,9],[318,10,318,11],[319,6,319,7],[319,8,319,9],[320,6,320,7],[320,8,320,9],[321,6,321,7],[321,8,321,9],[322,6,322,7],[322,8,322,9],[325,4,325,5],[325,6,325,7],[325,8,325,9],[326,6,326,7],[327,4,327,5],[327,8,327,9],[328,4,328,5],[328,6,328,7],[328,10,328,11],[329,4,329,5],[329,6,329,7],[329,8,329,9],[330,0,330,1],[330,4,330,5],[330,6,330,7],[330,8,330,9],[331,6,331,7],[331,8,331,9],[331,10,331,11],[332,6,332,7],[332,8,332,9],[333,6,333,7],[333,8,333,9],[333,10,333,11],[334,6,334,7],[334,8,334,9],[335,6,335,7],[335,8,335,9],[335,10,335,11],[336,6,336,7],[336,8,336,9],[339,4,339,5],[339,6,339,7],[339,8,339,9],[340,6,340,7],[340,8,340,9],[341,4,341,5],[341,8,341,9],[342,4,342,5],[342,6,342,7],[343,4,343,5],[343,6,343,7],[343,8,343,9],[344,0,344,1],[344,4,344,5],[344,6,344,7],[344,8,344,9],[344,10,344,11],[346,10,346,11],[349,8,349,9],[349,10,349,11],[350,6,350,7],[350,8,350,9],[353,4,353,5],[354,6,354,7],[354,8,354,9],[354,10,354,11],[355,4,355,5],[355,8,355,9],[355,10,355,11],[356,4,356,5],[356,6,356,7],[356,10,356,11],[357,4,357,5],[357,6,357,7],[357,8,357,9],[358,0,358,1],[358,4,358,5],[358,6,358,7],[358,8,358,9],[358,10,358,11],[359,6,359,7],[359,8,359,9],[359,10,359,11],[360,6,360,7],[360,8,360,9],[360,10,360,11],[361,6,361,7],[361,8,361,9],[361,10,361,11],[362,6,362,7],[362,8,362,9],[362,10,362,11],[363,6,363,7],[363,8,363,9],[363,10,363,11],[364,6,364,7],[364,8,364,9],[364,10,364,11],[367,4,367,5],[367,6,367,7],[367,8,367,9],[368,6,368,7],[368,8,368,9],[368,10,368,11],[369,4,369,5],[370,4,370,5],[370,6,370,7],[370,10,370,11],[371,4,371,5],[371,6,371,7],[372,0,372,1],[372,4,372,5],[372,6,372,7],[372,8,372,9],[373,6,373,7],[373,10,373,11],[374,6,374,7],[374,8,374,9],[374,10,374,11],[375,6,375,7],[376,6,376,7],[376,8,376,9],[376,10,376,11],[377,6,377,7],[377,8,377,9],[377,10,377,11],[378,6,378,7],[378,8,378,9],[381,4,381,5],[381,6,381,7],[381,8,381,9],[381,10,381,11],[382,6,382,7],[382,8,382,9],[382,10,382,11],[383,4,383,5],[383,8,383,9],[383,10,383,11],[384,4,384,5],[384,6,384,7],[384,10,384,11],[385,4,385,5],[385,6,385,7],[385,8,385,9],[386,0,386,1],[386,4,386,5],[386,6,386,7],[386,8,386,9],[386,10,386,11],[387,6,387,7],[387,10,387,11],[388,6,388,7],[388,8,388,9],[388,10,388,11],[389,6,389,7],[389,8,389,9],[389,10,389,11],[390,6,390,7],[390,8,390,9],[390,10,390,11],[391,6,391,7],[391,8,391,9],[391,10,391,11],[392,6,392,7],[392,8,392,9],[392,10,392,11],[395,4,395,5],[395,6,395,7],[395,8,395,9],[395,10,395,11],[396,6,396,7],[396,8,396,9],[396,10,396,11],[397,4,397,5],[397,8,397,9],[397,10,397,11],[398,4,398,5],[398,6,398,7],[398,10,398,11],[399,4,399,5],[399,6,399,7],[399,8,399,9],[400,0,400,1],[400,4,400,5],[400,6,400,7],[400,8,400,9],[400,10,400,11],[401,6,401,7],[401,8,401,9],[401,10,401,11],[402,6,402,7],[402,10,402,11],[403,6,403,7],[403,8,403,9],[404,6,404,7],[404,8,404,9],[404,10,404,11],[405,6,405,7],[405,8,405,9],[405,10,405,11],[406,6,406,7],[406,10,406,11],[409,4,409,5],[409,6,409,7],[409,10,409,11],[410,6,410,7],[410,8,410,9],[411,4,411,5],[411,8,411,9],[411,10,411,11],[412,4,412,5],[412,6,412,7],[412,10,412,11],[413,4,413,5],[413,6,413,7],[414,0,414,1],[414,4,414,5],[414,6,414,7],[414,8,414,9],[414,10,414,11],[415,6,415,7],[415,8,415,9],[415,10,415,11],[416,6,416,7],[416,8,416,9],[416,10,416,11],[417,6,417,7],[417,8,417,9],[417,10,417,11],[418,6,418,7],[418,8,418,9],[418,10,418,11],[419,6,419,7],[419,8,419,9],[419,10,419,11],[420,6,420,7],[420,8,420,9],[420,10,420,11],[423,4,423,5],[423,6,423,7],[423,8,423,9],[423,10,423,11],[424,6,424,7],[424,8,424,9],[424,10,424,11],[425,4,425,5],[425,8,425,9],[425,10,425,11],[426,6,426,7],[426,10,426,11],[427,4,427,5],[427,6,427,7],[428,0,428,1],[428,4,428,5],[428,6,428,7],[428,8,428,9],[429,6,429,7],[430,6,430,7],[431,6,431,7],[431,8,431,9],[431,10,431,11],[432,6,432,7],[433,6,433,7],[433,8,433,9],[433,10,433,11],[434,6,434,7],[434,8,434,9],[434,10,434,11],[437,4,437,5],[437,6,437,7],[437,8,437,9],[438,6,438,7],[438,8,438,9],[438,10,438,11],[439,4,439,5],[439,8,439,9],[439,10,439,11],[440,10,440,11],[441,4,441,5],[441,6,441,7],[441,8,441,9],[442,4,442,5],[442,6,442,7],[442,10,442,11],[443,6,443,7],[443,8,443,9],[443,10,443,11],[444,6,444,7],[444,8,444,9],[444,10,444,11],[445,6,445,7],[445,8,445,9],[445,10,445,11],[446,6,446,7],[446,8,446,9],[446,10,446,11],[447,6,447,7],[447,8,447,9],[447,10,447,11],[448,6,448,7],[448,8,448,9],[448,10,448,11],[451,6,451,7],[451,8,451,9],[451,10,451,11],[452,6,452,7],[452,8,452,9],[452,10,452,11],[453,4,453,5],[453,8,453,9],[453,10,453,11],[454,10,454,11],[455,6,455,7],[455,8,455,9],[456,10,456,11],[457,6,457,7],[457,8,457,9],[457,10,457,11],[458,6,458,7],[458,8,458,9],[458,10,458,11],[459,6,459,7],[459,8,459,9],[459,10,459,11],[460,6,460,7],[460,8,460,9],[460,10,460,11],[461,6,461,7],[461,8,461,9],[461,10,461,11],[462,6,462,7],[462,8,462,9],[462,10,462,11]],"merged_total":1319,"flags":["merged_cut"]}
[null,null,{"$f":"info!C3","v":"Otvoreno prvenstvo RSTSN"},{"$nulls":14},{"$f":"info!C4","v":"mlađi kadeti"}]
[]
[{"$nulls":3},"grupa 1"]
[null,"br.",null,"igrač",1,null,2,null,3,null,4,null,"pobede","porazi","mesto",null,"plasman grupe 1"]
[1,{"v":11,"d":"1-1"},{"$f":"IF(ISNA(MATCH(B5,spisak!$F$4:$F$308,0)),\"\",INDEX(spisak!$C$4:$C$308,MATCH(B5,spisak!$F$4:$F$308,0)))","v":"Napad"},{"$f":"IF(ISNA(MATCH(B5,spisak!$F$4:$F$308,0)),\"bye\",INDEX(spisak!$B$4:$B$308,MATCH(B5,spisak!$F$4:$F$308,0)))","v":"Ilić Bogdan"},null,null,{"$f":"INDEX(E10:E15,MATCH(D5&D6,C10:C15&D10:D15,0))&\"/\"&INDEX(F10:F15,MATCH(D5&D6,C10:C15&D10:D15,0))","v":"3/0"},null,{"$f":"INDEX(E10:E15,MATCH(D5&D7,C10:C15&D10:D15,0))&\"/\"&INDEX(F10:F15,MATCH(D5&D7,C10:C15&D10:D15,0))","v":"3/0"},null,{"$f":"INDEX(E10:E15,MATCH(D5&D8,C10:C15&D10:D15,0))&\"/\"&INDEX(F10:F15,MATCH(D5&D8,C10:C15&D10:D15,0))","v":"/"},null,{"$f":"IF(ISBLANK(partije!$J$2),\"\",COUNTIFS(C10:C15,D5,E10:E15,3)+COUNTIFS(D10:D15,D5,F10:F15,3))","v":2},{"$f":"IF(ISBLANK(partije!$J$2),\"\",COUNTIFS(C10:C15,D5,E10:E15,\"<3\")+COUNTIFS(D10:D15,D5,F10:F15,\"<3\"))","v":0},1,1,{"$f":"IF(ISBLANK(D5),\"*\",INDEX(D5:D8,MATCH(P5,O5:O8,0)))","v":"Ilić Bogdan"}]
[2,{"v":12,"d":"1-2"},{"$f":"IF(ISNA(MATCH(B6,spisak!$F$4:$F$308,0)),\"\",INDEX(spisak!$C$4:$C$308,MATCH(B6,spisak!$F$4:$F$308,0)))","v":"Sinđelić Beograd"},{"$f":"IF(ISNA(MATCH(B6,spisak!$F$4:$F$308,0)),\"bye\",INDEX(spisak!$B$4:$B$308,MATCH(B6,spisak!$F$4:$F$308,0)))","v":"Ivančev Đorđe"},{"$f":"INDEX(F10:F15,MATCH(D5&D6,C10:C15&D10:D15,0))&\"/\"&INDEX(E10:E15,MATCH(D5&D6,C10:C15&D10:D15,0))","v":"0/3"},{"$nulls":3},{"$f":"INDEX(E10:E15,MATCH(D6&D7,C10:C15&D10:D15,0))&\"/\"&INDEX(F10:F15,MATCH(D6&D7,C10:C15&D10:D15,0))","v":"1/3"},null,{"$f":"INDEX(E10:E15,MATCH(D6&D8,C10:C15&D10:D15,0))&\"/\"&INDEX(F10:F15,MATCH(D6&D8,C10:C15&D10:D15,0))","v":"/"},null,{"$f":"IF(ISBLANK(partije!$J$2),\"\",COUNTIFS(C10:C15,D6,E10:E15,3)+COUNTIFS(D10:D15,D6,F10:F15,3))","v":0},{"$f":"IF(ISBLANK(partije!$J$2),\"\",COUNTIFS(C10:C15,D6,E10:E15,\"<3\")+COUNTIFS(D10:D15,D6,F10:F15,\"<3\"))","v":2},3,2,{"$f":"IF(ISBLANK(D6),\"*\",INDEX(D5:D8,MATCH(P6,O5:O8,0)))","v":"Zaharijev  Nikola"}]
[3,{"v":13,"d":"1-3"},{"$f":"IF(ISNA(MATCH(B7,spisak!$F$4:$F$308,0)),\"\",INDEX(spisak!$C$4:$C$308,MATCH(B7,spisak!$F$4:$F$308,0)))","v":"Mladost Bosilegrad"},{"$f":"IF(ISNA(MATCH(B7,spisak!$F$4:$F$308,0)),\"bye\",INDEX(spisak!$B$4:$B$308,MATCH(B7,spisak!$F$4:$F$308,0)))","v":"Zaharijev  Nikola"},{"$f":"INDEX(F10:F15,MATCH(D5&D7,C10:C15&D10:D15,0))&\"/\"&INDEX(E10:E15,MATCH(D5&D7,C10:C15&D10:D15,0))","v":"0/3"},null,{"$f":"INDEX(F10:F15,MATCH(D6&D7,C10:C15&D10:D15,0))&\"/\"&INDEX(E10:E15,MATCH(D6&D7,C10:C15&D10:D15,0))","v":"3/1"},{"$nulls":3},{"$f":"INDEX(E10:E15,MATCH(D7&D8,C10:C15&D10:D15,0))&\"/\"&INDEX(F10:F15,MATCH(D7&D8,C10:C15&D10:D15,0))","v":"/"},null,{"$f":"IF(ISBLANK(partije!$J$2),\"\",COUNTIFS(C10:C15,D7,E10:E15,3)+COUNTIFS(D10:D15,D7,F10:F15,3))","v":1},{"$f":"IF(ISBLANK(partije!$J$2),\"\",COUNTIFS(C10:C15,D7,E10:E15,\"<3\")+COUNTIFS(D10:D15,D7,F10:F15,\"<3\"))","v":1},2,3,{"$f":"IF(ISBLANK(D7),\"*\",INDEX(D5:D8,MATCH(P7,O5:O8,0)))","v":"Ivančev Đorđe"}]
[4,{"v":14,"d":"1-4"},{"$f":"IF(ISNA(MATCH(B8,spisak!$F$4:$F$308,0)),\"\",INDEX(spisak!$C$4:$C$308,MATCH(B8,spisak!$F$4:$F$308,0)))","v":""},{"$f":"IF(ISNA(MATCH(B8,spisak!$F$4:$F$308,0)),\"bye\",INDEX(spisak!$B$4:$B$308,MATCH(B8,spisak!$F$4:$F$308,0)))","v":"bye"},{"$f":"INDEX(F10:F15,MATCH(D5&D8,C10:C15&D10:D15,0))&\"/\"&INDEX(E10:E15,MATCH(D5&D8,C10:C15&D10:D15,0))","v":"/"},null,{"$f":"INDEX(F10:F15,MATCH(D6&D8,C10:C15&D10:D15,0))&\"/\"&INDEX(E10:E15,MATCH(D6&D8,C10:C15&D10:D15,0))","v":"/"},null,{"$f":"INDEX(F10:F15,MATCH(D7&D8,C10:C15&D10:D15,0))&\"/\"&INDEX(E10:E15,MATCH(D7&D8,C10:C15&D10:D15,0))","v":"/"},{"$nulls":3},{"$f":"IF(ISBLANK(partije!$J$2),\"\",COUNTIFS(C10:C15,D8,E10:E15,3)+COUNTIFS(D10:D15,D8,F10:F15,3))","v":0},{"$f":"IF(ISBLANK(partije!$J$2),\"\",COUNTIFS(C10:C15,D8,E10:E15,\"<3\")+COUNTIFS(D10:D15,D8,F10:F15,\"<3\"))","v":0},null,4,{"$f":"IF(ISBLANK(D8),\"*\",INDEX(D5:D8,MATCH(P8,O5:O8,0)))","v":{"$error":"#N/A"}}]
[{"$nulls":4},"rezultat",null,"set1",null,"set 2",null,"set 3",null,"set 4","set 5","set 6","set 7",null,null,"berger4"]
[{"$f":"IF(ISBLANK(partije!D2),\"\",partije!D2)","v":""},{"$f":"IF(ISBLANK(partije!E2),\"\",partije!E2)","v":""},{"$f":"INDEX(D5:D8,MATCH(S10,A5:A8,0))","v":"Ilić Bogdan"},{"$f":"INDEX(D5:D8,MATCH(T10,A5:A8,0))","v":"Zaharijev  Nikola"},{"$f":"IF(ISBLANK(partije!J2),\"\",partije!J2)","v":3},{"$f":"IF(ISBLANK(partije!K2),\"\",partije!K2)","v":0},{"$f":"IF(ISBLANK(partije!L2),\"\",partije!L2)","v":{"v":1104,"d":"11-04"}},null,{"$f":"IF(ISBLANK(partije!M2),\"\",partije!M2)","v":{"v":1102,"d":"11-02"}},null,{"$f":"IF(ISBLANK(partije!N2),\"\",partije!N2)","v":{"v":1108,"d":"11-08"}},null,{"$f":"IF(ISBLANK(partije!O2),\"\",partije!O2)","v":""},{"$f":"IF(ISBLANK(partije!P2),\"\",partije!P2)","v":""},{"$f":"IF(ISBLANK(partije!Q2),\"\",partije!Q2)","v":""},{"$f":"IF(ISBLANK(partije!R2),\"\",partije!R2)","v":""},{"$f":"IF(ISBLANK(partije!$D$2),\"\",partije!$D$2)","v":""},{"$f":"IF(ISBLANK(partije!$E$2),\"\",\"sto \"&partije!$E$2)","v":""},1,3]
[{"$f":"IF(ISBLANK(partije!D3),\"\",partije!D3)","v":""},{"$f":"IF(ISBLANK(partije!E3),\"\",partije!E3)","v":""},{"$f":"INDEX(D5:D8,MATCH(S11,A5:A8,0))","v":"Ivančev Đorđe"},{"$f":"INDEX(D5:D8,MATCH(T11,A5:A8,0))","v":"bye"},{"$f":"IF(ISBLANK(partije!J3),\"\",partije!J3)","v":""},{"$f":"IF(ISBLANK(partije!K3),\"\",partije!K3)","v":""},{"$f":"IF(ISBLANK(partije!L3),\"\",partije!L3)","v":""},null,{"$f":"IF(ISBLANK(partije!M3),\"\",partije!M3)","v":""},null,{"$f":"IF(ISBLANK(partije!N3),\"\",partije!N3)","v":""},null,{"$f":"IF(ISBLANK(partije!O3),\"\",partije!O3)","v":""},{"$f":"IF(ISBLANK(partije!P3),\"\",partije!P3)","v":""},{"$f":"IF(ISBLANK(partije!Q3),\"\",partije!Q3)","v":""},{"$f":"IF(ISBLANK(partije!R3),\"\",partije!R3)","v":""},{"$f":"IF(ISBLANK(partije!D3),\"\",partije!D3)","v":""},{"$f":"IF(ISBLANK(partije!E3),\"\",\"sto \"&partije!E3)","v":""},2,4]
[{"$f":"IF(ISBLANK(partije!D68),\"\",partije!D68)","v":""},{"$f":"IF(ISBLANK(partije!E68),\"\",partije!E68)","v":""},{"$f":"INDEX(D5:D8,MATCH(S12,A5:A8,0))","v":"Ilić Bogdan"},{"$f":"INDEX(D5:D8,MATCH(T12,A5:A8,0))","v":"Ivančev Đorđe"},{"$f":"IF(ISBLANK(partije!J68),\"\",partije!J68)","v":3},{"$f":"IF(ISBLANK(partije!K68),\"\",partije!K68)","v":0},{"$f":"IF(ISBLANK(partije!L68),\"\",partije!L68)","v":{"v":1104,"d":"11-04"}},null,{"$f":"IF(ISBLANK(partije!M68),\"\",partije!M68)","v":{"v":1106,"d":"11-06"}},null,{"$f":"IF(ISBLANK(partije!N68),\"\",partije!N68)","v":{"v":1107,"d":"11-07"}},null,{"$f":"IF(ISBLANK(partije!O68),\"\",partije!O68)","v":""},{"$f":"IF(ISBLANK(partije!P68),\"\",partije!P68)","v":""},{"$f":"IF(ISBLANK(partije!Q68),\"\",partije!Q68)","v":""},{"$f":"IF(ISBLANK(partije!R68),\"\",partije!R68)","v":""},{"$f":"IF(ISBLANK(partije!D68),\"\",partije!D68)","v":""},{"$f":"IF(ISBLANK(partije!E68),\"\",\"sto \"&partije!E68)","v":""},1,2]
[{"$f":"IF(ISBLANK(partije!D69),\"\",partije!D69)","v":""},{"$f":"IF(ISBLANK(partije!E69),\"\",partije!E69)","v":""},{"$f":"INDEX(D5:D8,MATCH(S13,A5:A8,0))","v":"Zaharijev  Nikola"},{"$f":"INDEX(D5:D8,MATCH(T13,A5:A8,0))","v":"bye"},{"$f":"IF(ISBLANK(partije!J69),\"\",partije!J69)","v":""},{"$f":"IF(ISBLANK(partije!K69),\"\",partije!K69)","v":""},{"$f":"IF(ISBLANK(partije!L69),\"\",partije!L69)","v":""},null,{"$f":"IF(ISBLANK(partije!M69),\"\",partije!M69)","v":""},null,{"$f":"IF(ISBLANK(partije!N69),\"\",partije!N69)","v":""},null,{"$f":"IF(ISBLANK(partije!O69),\"\",partije!O69)","v":""},{"$f":"IF(ISBLANK(partije!P69),\"\",partije!P69)","v":""},{"$f":"IF(ISBLANK(partije!Q69),\"\",partije!Q69)","v":""},{"$f":"IF(ISBLANK(partije!R69),\"\",partije!R69)","v":""},{"$f":"IF(ISBLANK(partije!D69),\"\",partije!D69)","v":""},{"$f":"IF(ISBLANK(partije!E69),\"\",\"sto \"&partije!E69)","v":""},3,4]
[{"$f":"IF(ISBLANK(partije!D134),\"\",partije!D134)","v":""},{"$f":"IF(ISBLANK(partije!E134),\"\",partije!E134)","v":""},{"$f":"INDEX(D5:D8,MATCH(S14,A5:A8,0))","v":"Ilić Bogdan"},{"$f":"INDEX(D5:D8,MATCH(T14,A5:A8,0))","v":"bye"},{"$f":"IF(ISBLANK(partije!J134),\"\",partije!J134)","v":""},{"$f":"IF(ISBLANK(partije!K134),\"\",partije!K134)","v":""},{"$f":"IF(ISBLANK(partije!L134),\"\",partije!L134)","v":""},null,{"$f":"IF(ISBLANK(partije!M134),\"\",partije!M134)","v":""},null,{"$f":"IF(ISBLANK(partije!N134),\"\",partije!N134)","v":""},null,{"$f":"IF(ISBLANK(partije!O134),\"\",partije!O134)","v":""},{"$f":"IF(ISBLANK(partije!P134),\"\",partije!P134)","v":""},{"$f":"IF(ISBLANK(partije!Q134),\"\",partije!Q134)","v":""},{"$f":"IF(ISBLANK(partije!R134),\"\",partije!R134)","v":""},{"$f":"IF(ISBLANK(partije!D134),\"\",partije!D134)","v":""},{"$f":"IF(ISBLANK(partije!E134),\"\",\"sto \"&partije!E134)","v":""},1,4]
[{"$f":"IF(ISBLANK(partije!D135),\"\",partije!D135)","v":""},{"$f":"IF(ISBLANK(partije!E135),\"\",partije!E135)","v":""},{"$f":"INDEX(D5:D8,MATCH(S15,A5:A8,0))","v":"Ivančev Đorđe"},{"$f":"INDEX(D5:D8,MATCH(T15,A5:A8,0))","v":"Zaharijev  Nikola"},{"$f":"IF(ISBLANK(partije!J135),\"\",partije!J135)","v":1},{"$f":"IF(ISBLANK(partije!K135),\"\",partije!K135)","v":3},{"$f":"IF(ISBLANK(partije!L135),\"\",partije!L135)","v":{"v":911,"d":"09-11"}},null,{"$f":"IF(ISBLANK(partije!M135),\"\",partije!M135)","v":{"v":411,"d":"04-11"}},null,{"$f":"IF(ISBLANK(partije!N135),\"\",partije!N135)","v":{"v":1103,"d":"11-03"}},null,{"$f":"IF(ISBLANK(partije!O135),\"\",partije!O135)","v":{"v":711,"d":"07-11"}},{"$f":"IF(ISBLANK(partije!P135),\"\",partije!P135)","v":""},{"$f":"IF(ISBLANK(partije!Q135),\"\",partije!Q135)","v":""},{"$f":"IF(ISBLANK(partije!R135),\"\",partije!R135)","v":""},{"$f":"IF(ISBLANK(partije!D135),\"\",partije!D135)","v":""},{"$f":"IF(ISBLANK(partije!E135),\"\",\"sto \"&partije!E135)","v":""},2,3]
[]
[{"$nulls":3},"grupa 2"]
[null,"br.",null,"igrač",1,null,2,null,3,null,4,null,"pobede","porazi","mesto",null,"plasman grupe 2"]
[1,{"v":21,"d":"2-1"},{"$f":"IF(ISNA(MATCH(B19,spisak!$F$4:$F$308,0)),\"\",INDEX(spisak!$C$4:$C$308,MATCH(B19,spisak!$F$4:$F$308,0)))","v":"Stak Zemun"},{"$f":"IF(ISNA(MATCH(B19,spisak!$F$4:$F$308,0)),\"bye\",INDEX(spisak!$B$4:$B$308,MATCH(B19,spisak!$F$4:$F$308,0)))","v":"Šepa Matija"},null,null,{"$f":"INDEX(E24:E29,MATCH(D19&D20,C24:C29&D24:D29,0))&\"/\"&INDEX(F24:F29,MATCH(D19&D20,C24:C29&D24:D29,0))","v":"3/0"},null,{"$f":"INDEX(E24:E29,MATCH(D19&D21,C24:C29&D24:D29,0))&\"/\"&INDEX(F24:F29,MATCH(D19&D21,C24:C29&D24:D29,0))","v":"3/0"},null,{"$f":"INDEX(E24:E29,MATCH(D19&D22,C24:C29&D24:D29,0))&\"/\"&INDEX(F24:F29,MATCH(D19&D22,C24:C29&D24:D29,0))","v":"/"},null,{"$f":"IF(ISBLANK(partije!$J$2),\"\",COUNTIFS(C24:C29,D19,E24:E29,3)+COUNTIFS(D24:D29,D19,F24:F29,3))","v":2},{"$f":"IF(ISBLANK(partije!$J$2),\"\",COUNTIFS(C24:C29,D19,E24:E29,\"<3\")+COUNTIFS(D24:D29,D19,F24:F29,\"<3\"))","v":0},1,1,{"$f":"IF(ISBLANK(D19),\"*\",INDEX(D19:D22,MATCH(P19,O19:O22,0)))","v":"Šepa Matija"}]
[2,{"v":22,"d":"2-2"},{"$f":"IF(ISNA(MATCH(B20,spisak!$F$4:$F$308,0)),\"\",INDEX(spisak!$C$4:$C$308,MATCH(B20,spisak!$F$4:$F$308,0)))","v":"Milenijum"},{"$f":"IF(ISNA(MATCH(B20,spisak!$F$4:$F$308,0)),\"bye\",INDEX(spisak!$B$4:$B$308,MATCH(B20,spisak!$F$4:$F$308,0)))","v":"Putnik Dario"},{"$f":"INDEX(F24:F29,MATCH(D19&D20,C24:C29&D24:D29,0))&\"/\"&INDEX(E24:E29,MATCH(D19&D20,C24:C29&D24:D29,0))","v":"0/3"},{"$nulls":3},{"$f":"INDEX(E24:E29,MATCH(D20&D21,C24:C29&D24:D29,0))&\"/\"&INDEX(F24:F29,MATCH(D20&D21,C24:C29&D24:D29,0))","v":"3/0"},null,{"$f":"INDEX(E24:E29,MATCH(D20&D22,C24:C29&D24:D29,0))&\"/\"&INDEX(F24:F29,MATCH(D20&D22,C24:C29&D24:D29,0))","v":"/"},null,{"$f":"IF(ISBLANK(partije!$J$2),\"\",COUNTIFS(C24:C29,D20,E24:E29,3)+COUNTIFS(D24:D29,D20,F24:F29,3))","v":1},{"$f":"IF(ISBLANK(partije!$J$2),\"\",COUNTIFS(C24:C29,D20,E24:E29,\"<3\")+COUNTIFS(D24:D29,D20,F24:F29,\"<3\"))","v":1},2,2,{"$f":"IF(ISBLANK(D20),\"*\",INDEX(D19:D22,MATCH(P20,O19:O22,0)))","v":"Putnik Dario"}]
[3,{"v":23,"d":"2-3"},{"$f":"IF(ISNA(MATCH(B21,spisak!$F$4:$F$308,0)),\"\",INDEX(spisak!$C$4:$C$308,MATCH(B21,spisak!$F$4:$F$308,0)))","v":"Dubočica Leskovac"},{"$f":"IF(ISNA(MATCH(B21,spisak!$F$4:$F$308,0)),\"bye\",INDEX(spisak!$B$4:$B$308,MATCH(B21,spisak!$F$4:$F$308,0)))","v":"Jović Aleksandar"},{"$f":"INDEX(F24:F29,MATCH(D19&D21,C24:C29&D24:D29,0))&\"/\"&INDEX(E24:E29,MATCH(D19&D21,C24:C29&D24:D29,0))","v":"0/3"},null,{"$f":"INDEX(F24:F29,MATCH(D20&D21,C24:C29&D24:D29,0))&\"/\"&INDEX(E24:E29,MATCH(D20&D21,C24:C29&D24:D29,0))","v":"0/3"},{"$nulls":3},{"$f":"INDEX(E24:E29,MATCH(D21&D22,C24:C29&D24:D29,0))&\"/\"&INDEX(F24:F29,MATCH(D21&D22,C24:C29&D24:D29,0))","v":"/"},null,{"$f":"IF(ISBLANK(partije!$J$2),\"\",COUNTIFS(C24:C29,D21,E24:E29,3)+COUNTIFS(D24:D29,D21,F24:F29,3))","v":0},{"$f":"IF(ISBLANK(partije!$J$2),\"\",COUNTIFS(C24:C29,D21,E24:E29,\"<3\")+COUNTIFS(D24:D29,D21,F24:F29,\"<3\"))","v":2},3,3,{"$f":"IF(ISBLANK(D21),\"*\",INDEX(D19:D22,MATCH(P21,O19:O22,0)))","v":"Jović Aleksandar"}]
[4,{"v":24,"d":"2-4"},{"$f":"IF(ISNA(MATCH(B22,spisak!$F$4:$F$308,0)),\"\",INDEX(spisak!$C$4:$C$308,MATCH(B22,spisak!$F$4:$F$308,0)))","v":""},{"$f":"IF(ISNA(MATCH(B22,spisak!$F$4:$F$308,0)),\"bye\",INDEX(spisak!$B$4:$B$308,MATCH(B22,spisak!$F$4:$F$308,0)))","v":"bye"},{"$f":"INDEX(F24:F29,MATCH(D19&D22,C24:C29&D24:D29,0))&\"/\"&INDEX(E24:E29,MATCH(D19&D22,C24:C29&D24:D29,0))","v":"/"},null,{"$f":"INDEX(F24:F29,MATCH(D20&D22,C24:C29&D24:D29,0))&\"/\"&INDEX(E24:E29,MATCH(D20&D22,C24:C29&D24:D29,0))","v":"/"},null,{"$f":"INDEX(F24:F29,MATCH(D21&D22,C24:C29&D24:D29,0))&\"/\"&INDEX(E24:E29,MATCH(D21&D22,C24:C29&D24:D29,0))","v":"/"},{"$nulls":3},{"$f":"IF(ISBLANK(partije!$J$2),\"\",COUNTIFS(C24:C29,D22,E24:E29,3)+COUNTIFS(D24:D29,D22,F24:F29,3))","v":0},{"$f":"IF(ISBLANK(partije!$J$2),\"\",COUNTIFS(C24:C29,D22,E24:E29,\"<3\")+COUNTIFS(D24:D29,D22,F24:F29,\"<3\"))","v":0},null,4,{"$f":"IF(ISBLANK(D22),\"***\",INDEX(D19:D22,MATCH(P22,O19:O22,0)))","v":{"$error":"#N/A"}}]
[{"$nulls":4},"rezultat",null,"set1",null,"set 2",null,"set 3",null,"set 4","set 5","set 6","set 7",null,null,"berger4"]
[{"$f":"IF(ISBLANK(partije!D4),\"\",partije!D4)","v":""},{"$f":"IF(ISBLANK(partije!E4),\"\",partije!E4)","v":""},{"$f":"INDEX(D19:D22,MATCH(S24,A19:A22,0))","v":"Šepa Matija"},{"$f":"INDEX(D19:D22,MATCH(T24,A19:A22,0))","v":"Jović Aleksandar"},{"$f":"IF(ISBLANK(partije!J4),\"\",partije!J4)","v":3},{"$f":"IF(ISBLANK(partije!K4),\"\",partije!K4)","v":0},{"$f":"IF(ISBLANK(partije!L4),\"\",partije!L4)","v":{"v":1104,"d":"11-04"}},null,{"$f":"IF(ISBLANK(partije!M4),\"\",partije!M4)","v":{"v":1102,"d":"11-02"}},null,{"$f":"IF(ISBLANK(partije!N4),\"\",partije!N4)","v":{"v":1106,"d":"11-06"}},{"$f":"IF(ISBLANK(partije!M16),\"\",partije!M16)","v":{"v":1105,"d":"11-05"}},{"$f":"IF(ISBLANK(partije!O4),\"\",partije!O4)","v":""},{"$f":"IF(ISBLANK(partije!P4),\"\",partije!P4)","v":""},{"$f":"IF(ISBLANK(partije!Q4),\"\",partije!Q4)","v":""},{"$f":"IF(ISBLANK(partije!R4),\"\",partije!R4)","v":""},{"$f":"IF(ISBLANK(partije!$D$4),\"\",partije!$D$4)","v":""},{"$f":"IF(ISBLANK(partije!$E$4),\"\",\"sto \"&partije!$E$4)","v":""},{"$f":"$S$10","v":1},{"$f":"$T$10","v":3}]
[{"$f":"IF(ISBLANK(partije!D5),\"\",partije!D5)","v":""},{"$f":"IF(ISBLANK(partije!E5),\"\",partije!E5)","v":""},{"$f":"INDEX(D19:D22,MATCH(S25,A19:A22,0))","v":"Putnik Dario"},{"$f":"INDEX(D19:D22,MATCH(T25,A19:A22,0))","v":"bye"},{"$f":"IF(ISBLANK(partije!J5),\"\",partije!J5)","v":""},{"$f":"IF(ISBLANK(partije!K5),\"\",partije!K5)","v":""},null,null,{"$f":"IF(ISBLANK(partije!M5),\"\",partije!M5)","v":""},null,{"$f":"IF(ISBLANK(partije!N5),\"\",partije!N5)","v":""},null,{"$f":"IF(ISBLANK(partije!O5),\"\",partije!O5)","v":""},{"$f":"IF(ISBLANK(partije!P5),\"\",partije!P5)","v":""},{"$f":"IF(ISBLANK(partije!Q5),\"\",partije!Q5)","v":""},{"$f":"IF(ISBLANK(partije!R5),\"\",partije!R5)","v":""},{"$f":"IF(ISBLANK(partije!$D$5),\"\",partije!$D$5)","v":""},{"$f":"IF(ISBLANK(partije!$E$5),\"\",\"sto \"&partije!$E$5)","v":""},{"$f":"$S$11","v":2},{"$f":"$T$11","v":4}]
[{"$f":"IF(ISBLANK(partije!D70),\"\",partije!D70)","v":""},{"$f":"IF(ISBLANK(partije!E70),\"\",partije!E70)","v":""},{"$f":"INDEX(D19:D22,MATCH(S26,A19:A22,0))","v":"Šepa Matija"},{"$f":"INDEX(D19:D22,MATCH(T26,A19:A22,0))","v":"Putnik Dario"},{"$f":"IF(ISBLANK(partije!J70),\"\",partije!J70)","v":3},{"$f":"IF(ISBLANK(partije!K70),\"\",partije!K70)","v":0},{"$f":"IF(ISBLANK(partije!L70),\"\",partije!L70)","v":{"v":1104,"d":"11-04"}},null,{"$f":"IF(ISBLANK(partije!M70),\"\",partije!M70)","v":{"v":1106,"d":"11-06"}},null,{"$f":"IF(ISBLANK(partije!N70),\"\",partije!N70)","v":{"v":1105,"d":"11-05"}},{"$f":"IF(ISBLANK(partije!M18),\"\",partije!M18)","v":{"v":1104,"d":"11-04"}},{"$f":"IF(ISBLANK(partije!O70),\"\",partije!O70)","v":""},{"$f":"IF(ISBLANK(partije!P70),\"\",partije!P70)","v":""},{"$f":"IF(ISBLANK(partije!Q70),\"\",partije!Q70)","v":""},{"$f":"IF(ISBLANK(partije!R70),\"\",partije!R70)","v":""},{"$f":"IF(ISBLANK(partije!$D$70),\"\",partije!$D$70)","v":""},{"$f":"IF(ISBLANK(partije!$E$70),\"\",\"sto \"&partije!$E$70)","v":""},{"$f":"$S$12","v":1},{"$f":"$T$12","v":2}]
[{"$f":"IF(ISBLANK(partije!D71),\"\",partije!D71)","v":""},{"$f":"IF(ISBLANK(partije!E71),\"\",partije!E71)","v":""},{"$f":"INDEX(D19:D22,MATCH(S27,A19:A22,0))","v":"Jović Aleksandar"},{"$f":"INDEX(D19:D22,MATCH(T27,A19:A22,0))","v":"bye"},{"$f":"IF(ISBLANK(partije!J71),\"\",partije!J71)","v":""},{"$f":"IF(ISBLANK(partije!K71),\"\",partije!K71)","v":""},{"$f":"IF(ISBLANK(partije!L71),\"\",partije!L71)","v":""},null,{"$f":"IF(ISBLANK(partije!M71),\"\",partije!M71)","v":""},null,{"$f":"IF(ISBLANK(partije!N71),\"\",partije!N71)","v":""},{"$f":"IF(ISBLANK(partije!M19),\"\",partije!M19)","v":""},{"$f":"IF(ISBLANK(partije!O71),\"\",partije!O71)","v":""},{"$f":"IF(ISBLANK(partije!P71),\"\",partije!P71)","v":""},{"$f":"IF(ISBLANK(partije!Q71),\"\",partije!Q71)","v":""},{"$f":"IF(ISBLANK(partije!R71),\"\",partije!R71)","v":""},{"$f":"IF(ISBLANK(partije!$D$71),\"\",partije!$D$71)","v":""},{"$f":"IF(ISBLANK(partije!$E$71),\"\",\"sto \"&partije!$E$71)","v":""},{"$f":"$S$13","v":3},{"$f":"$T$13","v":4}]
[{"$f":"IF(ISBLANK(partije!D136),\"\",partije!D136)","v":""},{"$f":"IF(ISBLANK(partije!E136),\"\",partije!E136)","v":""},{"$f":"INDEX(D19:D22,MATCH(S28,A19:A22,0))","v":"Šepa Matija"},{"$f":"INDEX(D19:D22,MATCH(T28,A19:A22,0))","v":"bye"},{"$f":"IF(ISBLANK(partije!J136),\"\",partije!J136)","v":""},{"$f":"IF(ISBLANK(partije!K136),\"\",partije!K136)","v":""},{"$f":"IF(ISBLANK(partije!L136),\"\",partije!L136)","v":""},null,{"$f":"IF(ISBLANK(partije!M136),\"\",partije!M136)","v":""},null,{"$f":"IF(ISBLANK(partije!N136),\"\",partije!N136)","v":""},{"$f":"IF(ISBLANK(partije!M20),\"\",partije!M20)","v":{"v":1104,"d":"11-04"}},{"$f":"IF(ISBLANK(partije!O136),\"\",partije!O136)","v":""},{"$f":"IF(ISBLANK(partije!P136),\"\",partije!P136)","v":""},{"$f":"IF(ISBLANK(partije!Q136),\"\",partije!Q136)","v":""},{"$f":"IF(ISBLANK(partije!R136),\"\",partije!R136)","v":""},{"$f":"IF(ISBLANK(partije!$D$136),\"\",partije!$D$136)","v":""},{"$f":"IF(ISBLANK(partije!$E$136),\"\",\"sto \"&partije!$E$136)","v":""},{"$f":"$S$14","v":1},{"$f":"$T$14","v":4}]
[{"$f":"IF(ISBLANK(partije!D137),\"\",partije!D137)","v":""},{"$f":"IF(ISBLANK(partije!E137),\"\",partije!E137)","v":""},{"$f":"INDEX(D19:D22,MATCH(S29,A19:A22,0))","v":"Putnik Dario"},{"$f":"INDEX(D19:D22,MATCH(T29,A19:A22,0))","v":"Jović Aleksandar"},{"$f":"IF(ISBLANK(partije!J137),\"\",partije!J137)","v":3},{"$f":"IF(ISBLANK(partije!K137),\"\",partije!K137)","v":0},{"$f":"IF(ISBLANK(partije!L137),\"\",partije!L137)","v":{"v":1109,"d":"11-09"}},null,{"$f":"IF(ISBLANK(partije!M137),\"\",partije!M137)","v":{"v":1106,"d":"11-06"}},null,{"$f":"IF(ISBLANK(partije!N137),\"\",partije!N137)","v":{"v":1108,"d":"11-08"}},{"$f":"IF(ISBLANK(partije!M21),\"\",partije!M21)","v":""},{"$f":"IF(ISBLANK(partije!O137),\"\",partije!O137)","v":""},{"$f":"IF(ISBLANK(partije!P137),\"\",partije!P137)","v":""},{"$f":"IF(ISBLANK(partije!Q137),\"\",partije!Q137)","v":""},{"$f":"IF(ISBLANK(partije!R137),\"\",partije!R137)","v":""},{"$f":"IF(ISBLANK(partije!$D$137),\"\",partije!$D$137)","v":""},{"$f":"IF(ISBLANK(partije!$E$137),\"\",\"sto \"&partije!$E$137)","v":""},{"$f":"$S$15","v":2},{"$f":"$T$15","v":3}]
[]
[{"$nulls":3},"grupa 3"]
[null,"br.",null,"igrač",1,null,2,null,3,null,4,null,"pobede","porazi","mesto",null,"plasman grupe 3"]
[1,{"v":31,"d":"3-1"},{"$f":"IF(ISNA(MATCH(B33,spisak!$F$4:$F$308,0)),\"\",INDEX(spisak!$C$4:$C$308,MATCH(B33,spisak!$F$4:$F$308,0)))","v":"Stak Zemun"},{"$f":"IF(ISNA(MATCH(B33,spisak!$F$4:$F$308,0)),\"bye\",INDEX(spisak!$B$4:$B$308,MATCH(B33,spisak!$F$4:$F$308,0)))","v":"Stefanović Vanja"},null,null,{"$f":"INDEX(E38:E43,MATCH(D33&D34,C38:C43&D38:D43,0))&\"/\"&INDEX(F38:F43,MATCH(D33&D34,C38:C43&D38:D43,0))","v":"w/0"},null,{"$f":"INDEX(E38:E43,MATCH(D33&D35,C38:C43&D38:D43,0))&\"/\"&INDEX(F38:F43,MATCH(D33&D35,C38:C43&D38:D43,0))","v":"3/0"},null,{"$f":"INDEX(E38:E43,MATCH(D33&D36,C38:C43&D38:D43,0))&\"/\"&INDEX(F38:F43,MATCH(D33&D36,C38:C43&D38:D43,0))","v":"/"},null,{"$f":"IF(ISBLANK(partije!$J$2),\"\",COUNTIFS(C38:C43,D33,E38:E43,3)+COUNTIFS(D38:D43,D33,F38:F43,3))","v":1},{"$f":"IF(ISBLANK(partije!$J$2),\"\",COUNTIFS(C38:C43,D33,E38:E43,\"<3\")+COUNTIFS(D38:D43,D33,F38:F43,\"<3\"))","v":0},1,1,{"$f":"IF(ISBLANK(D33),\"*\",INDEX(D33:D36,MATCH(P33,O33:O36,0)))","v":"Stefanović Vanja"}]
[2,{"v":32,"d":"3-2"},{"$f":"IF(ISNA(MATCH(B34,spisak!$F$4:$F$308,0)),\"\",INDEX(spisak!$C$4:$C$308,MATCH(B34,spisak!$F$4:$F$308,0)))","v":"Ugrinovci"},{"$f":"IF(ISNA(MATCH(B34,spisak!$F$4:$F$308,0)),\"bye\",INDEX(spisak!$B$4:$B$308,MATCH(B34,spisak!$F$4:$F$308,0)))","v":"Kalinić Ilija"},{"$f":"INDEX(F38:F43,MATCH(D33&D34,C38:C43&D38:D43,0))&\"/\"&INDEX(E38:E43,MATCH(D33&D34,C38:C43&D38:D43,0))","v":"0/w"},{"$nulls":3},{"$f":"INDEX(E38:E43,MATCH(D34&D35,C38:C43&D38:D43,0))&\"/\"&INDEX(F38:F43,MATCH(D34&D35,C38:C43&D38:D43,0))","v":"w/0"},null,{"$f":"INDEX(E38:E43,MATCH(D34&D36,C38:C43&D38:D43,0))&\"/\"&INDEX(F38:F43,MATCH(D34&D36,C38:C43&D38:D43,0))","v":"/"},null,{"$f":"IF(ISBLANK(partije!$J$2),\"\",COUNTIFS(C38:C43,D34,E38:E43,3)+COUNTIFS(D38:D43,D34,F38:F43,3))","v":0},{"$f":"IF(ISBLANK(partije!$J$2),\"\",COUNTIFS(C38:C43,D34,E38:E43,\"<3\")+COUNTIFS(D38:D43,D34,F38:F43,\"<3\"))","v":1},null,2,{"$f":"IF(ISBLANK(D34),\"*\",INDEX(D33:D36,MATCH(P34,O33:O36,0)))","v":"Velinović Miloš"}]
[3,{"v":33,"d":"3-3"},{"$f":"IF(ISNA(MATCH(B35,spisak!$F$4:$F$308,0)),\"\",INDEX(spisak!$C$4:$C$308,MATCH(B35,spisak!$F$4:$F$308,0)))","v":"Belo Polje"},{"$f":"IF(ISNA(MATCH(B35,spisak!$F$4:$F$308,0)),\"bye\",INDEX(spisak!$B$4:$B$308,MATCH(B35,spisak!$F$4:$F$308,0)))","v":"Velinović Miloš"},{"$f":"INDEX(F38:F43,MATCH(D33&D35,C38:C43&D38:D43,0))&\"/\"&INDEX(E38:E43,MATCH(D33&D35,C38:C43&D38:D43,0))","v":"0/3"},null,{"$f":"INDEX(F38:F43,MATCH(D34&D35,C38:C43&D38:D43,0))&\"/\"&INDEX(E38:E43,MATCH(D34&D35,C38:C43&D38:D43,0))","v":"0/w"},{"$nulls":3},{"$f":"INDEX(E38:E43,MATCH(D35&D36,C38:C43&D38:D43,0))&\"/\"&INDEX(F38:F43,MATCH(D35&D36,C38:C43&D38:D43,0))","v":"/"},null,{"$f":"IF(ISBLANK(partije!$J$2),\"\",COUNTIFS(C38:C43,D35,E38:E43,3)+COUNTIFS(D38:D43,D35,F38:F43,3))","v":0},{"$f":"IF(ISBLANK(partije!$J$2),\"\",COUNTIFS(C38:C43,D35,E38:E43,\"<3\")+COUNTIFS(D38:D43,D35,F38:F43,\"<3\"))","v":2},2,3,{"$f":"IF(ISBLANK(D35),\"*\",INDEX(D33:D36,MATCH(P35,O33:O36,0)))","v":{"$error":"#N/A"}}]
[4,{"v":34,"d":"3-4"},{"$f":"IF(ISNA(MATCH(B36,spisak!$F$4:$F$308,0)),\"\",INDEX(spisak!$C$4:$C$308,MATCH(B36,spisak!$F$4:$F$308,0)))","v":""},{"$f":"IF(ISNA(MATCH(B36,spisak!$F$4:$F$308,0)),\"bye\",INDEX(spisak!$B$4:$B$308,MATCH(B36,spisak!$F$4:$F$308,0)))","v":"bye"},{"$f":"INDEX(F38:F43,MATCH(D33&D36,C38:C43&D38:D43,0))&\"/\"&INDEX(E38:E43,MATCH(D33&D36,C38:C43&D38:D43,0))","v":"/"},null,{"$f":"INDEX(F38:F43,MATCH(D34&D36,C38:C43&D38:D43,0))&\"/\"&INDEX(E38:E43,MATCH(D34&D36,C38:C43&D38:D43,0))","v":"/"},null,{"$f":"INDEX(F38:F43,MATCH(D35&D36,C38:C43&D38:D43,0))&\"/\"&INDEX(E38:E43,MATCH(D35&D36,C38:C43&D38:D43,0))","v":"/"},{"$nulls":3},{"$f":"IF(ISBLANK(partije!$J$2),\"\",COUNTIFS(C38:C43,D36,E38:E43,3)+COUNTIFS(D38:D43,D36,F38:F43,3))","v":0},{"$f":"IF(ISBLANK(partije!$J$2),\"\",COUNTIFS(C38:C43,D36,E38:E43,\"<3\")+COUNTIFS(D38:D43,D36,F38:F43,\"<3\"))","v":0},null,4,{"$f":"IF(ISBLANK(D36),\"***\",INDEX(D33:D36,MATCH(P36,O33:O36,0)))","v":{"$error":"#N/A"}}]
[{"$nulls":4},"rezultat",null,"set1",null,"set 2",null,"set 3",null,"set 4","set 5","set 6","set 7",null,null,"berger4"]
[{"$f":"IF(ISBLANK(partije!D6),\"\",partije!D6)","v":""},{"$f":"IF(ISBLANK(partije!E6),\"\",partije!E6)","v":""},{"$f":"INDEX(D33:D36,MATCH(S38,A33:A36,0))","v":"Stefanović Vanja"},{"$f":"INDEX(D33:D36,MATCH(T38,A33:A36,0))","v":"Velinović Miloš"},{"$f":"IF(ISBLANK(partije!J6),\"\",partije!J6)","v":3},{"$f":"IF(ISBLANK(partije!K6),\"\",partije!K6)","v":0},{"$f":"IF(ISBLANK(partije!L6),\"\",partije!L6)","v":{"v":1102,"d":"11-02"}},null,{"$f":"IF(ISBLANK(partije!M6),\"\",partije!M6)","v":{"v":1104,"d":"11-04"}},null,{"$f":"IF(ISBLANK(partije!N6),\"\",partije!N6)","v":{"v":1103,"d":"11-03"}},null,{"$f":"IF(ISBLANK(partije!O6),\"\",partije!O6)","v":""},{"$f":"IF(ISBLANK(partije!P6),\"\",partije!P6)","v":""},{"$f":"IF(ISBLANK(partije!Q6),\"\",partije!Q6)","v":""},{"$f":"IF(ISBLANK(partije!R6),\"\",partije!R6)","v":""},{"$f":"IF(ISBLANK(partije!$D$6),\"\",partije!$D$6)","v":""},{"$f":"IF(ISBLANK(partije!$E$6),\"\",\"sto \"&partije!$E$6)","v":""},{"$f":"$S$10","v":1},{"$f":"$T$10","v":3}]
[{"$f":"IF(ISBLANK(partije!D7),\"\",partije!D7)","v":""},{"$f":"IF(ISBLANK(partije!E7),\"\",partije!E7)","v":""},{"$f":"INDEX(D33:D36,MATCH(S39,A33:A36,0))","v":"Kalinić Ilija"},{"$f":"INDEX(D33:D36,MATCH(T39,A33:A36,0))","v":"bye"},{"$f":"IF(ISBLANK(partije!J7),\"\",partije!J7)","v":""},{"$f":"IF(ISBLANK(partije!K7),\"\",partije!K7)","v":""},{"$f":"IF(ISBLANK(partije!L7),\"\",partije!L7)","v":""},null,{"$f":"IF(ISBLANK(partije!M7),\"\",partije!M7)","v":""},null,{"$f":"IF(ISBLANK(partije!N7),\"\",partije!N7)","v":""},null,{"$f":"IF(ISBLANK(partije!O7),\"\",partije!O7)","v":""},{"$f":"IF(ISBLANK(partije!P7),\"\",partije!P7)","v":""},{"$f":"IF(ISBLANK(partije!Q7),\"\",partije!Q7)","v":""},{"$f":"IF(ISBLANK(partije!R7),\"\",partije!R7)","v":""},{"$f":"IF(ISBLANK(partije!$D$7),\"\",partije!$D$7)","v":""},{"$f":"IF(ISBLANK(partije!$E$7),\"\",\"sto \"&partije!$E$7)","v":""},{"$f":"$S$11","v":2},{"$f":"$T$11","v":4}]
[{"$f":"IF(ISBLANK(partije!D72),\"\",partije!D72)","v":""},{"$f":"IF(ISBLANK(partije!E72),\"\",partije!E72)","v":""},{"$f":"INDEX(D33:D36,MATCH(S40,A33:A36,0))","v":"Stefanović Vanja"},{"$f":"INDEX(D33:D36,MATCH(T40,A33:A36,0))","v":"Kalinić Ilija"},{"$f":"IF(ISBLANK(partije!J72),\"\",partije!J72)","v":"w"},{"$f":"IF(ISBLANK(partije!K72),\"\",partije!K72)","v":0},{"$f":"IF(ISBLANK(partije!L72),\"\",partije!L72)","v":""},null,{"$f":"IF(ISBLANK(partije!M72),\"\",partije!M72)","v":""},null,{"$f":"IF(ISBLANK(partije!N72),\"\",partije!N72)","v":""},null,{"$f":"IF(ISBLANK(partije!O72),\"\",partije!O72)","v":""},{"$f":"IF(ISBLANK(partije!P72),\"\",partije!P72)","v":""},{"$f":"IF(ISBLANK(partije!Q72),\"\",partije!Q72)","v":""},{"$f":"IF(ISBLANK(partije!R72),\"\",partije!R72)","v":""},{"$f":"IF(ISBLANK(partije!$D$72),\"\",partije!$D$72)","v":""},{"$f":"IF(ISBLANK(partije!$E$72),\"\",\"sto \"&partije!$E$72)","v":""},{"$f":"$S$12","v":1},{"$f":"$T$12","v":2}]
[{"$f":"IF(ISBLANK(partije!D73),\"\",partije!D73)","v":""},{"$f":"IF(ISBLANK(partije!E73),\"\",partije!E73)","v":""},{"$f":"INDEX(D33:D36,MATCH(S41,A33:A36,0))","v":"Velinović Miloš"},{"$f":"INDEX(D33:D36,MATCH(T41,A33:A36,0))","v":"bye"},{"$f":"IF(ISBLANK(partije!J73),\"\",partije!J73)","v":""},{"$f":"IF(ISBLANK(partije!K73),\"\",partije!K73)","v":""},{"$f":"IF(ISBLANK(partije!L73),\"\",partije!L73)","v":""},null,{"$f":"IF(ISBLANK(partije!M73),\"\",partije!M73)","v":""},null,{"$f":"IF(ISBLANK(partije!N73),\"\",partije!N73)","v":""},null,{"$f":"IF(ISBLANK(partije!O73),\"\",partije!O73)","v":""},{"$f":"IF(ISBLANK(partije!P73),\"\",partije!P73)","v":""},{"$f":"IF(ISBLANK(partije!Q73),\"\",partije!Q73)","v":""},{"$f":"IF(ISBLANK(partije!R73),\"\",partije!R73)","v":""},{"$f":"IF(ISBLANK(partije!$D$73),\"\",partije!$D$73)","v":""},{"$f":"IF(ISBLANK(partije!$E$73),\"\",\"sto \"&partije!$E$73)","v":""},{"$f":"$S$13","v":3},{"$f":"$T$13","v":4}]
[{"$f":"IF(ISBLANK(partije!D138),\"\",partije!D138)","v":""},{"$f":"IF(ISBLANK(partije!E138),\"\",partije!E138)","v":""},{"$f":"INDEX(D33:D36,MATCH(S42,A33:A36,0))","v":"Stefanović Vanja"},{"$f":"INDEX(D33:D36,MATCH(T42,A33:A36,0))","v":"bye"},{"$f":"IF(ISBLANK(partije!J138),\"\",partije!J138)","v":""},{"$f":"IF(ISBLANK(partije!K138),\"\",partije!K138)","v":""},{"$f":"IF(ISBLANK(partije!L138),\"\",partije!L138)","v":""},null,{"$f":"IF(ISBLANK(partije!M138),\"\",partije!M138)","v":""},null,{"$f":"IF(ISBLANK(partije!N138),\"\",partije!N138)","v":""},null,{"$f":"IF(ISBLANK(partije!O138),\"\",partije!O138)","v":""},{"$f":"IF(ISBLANK(partije!P138),\"\",partije!P138)","v":""},{"$f":"IF(ISBLANK(partije!Q138),\"\",partije!Q138)","v":""},{"$f":"IF(ISBLANK(partije!R138),\"\",partije!R138)","v":""},{"$f":"IF(ISBLANK(partije!$D$138),\"\",partije!$D$138)","v":""},{"$f":"IF(ISBLANK(partije!$E$138),\"\",\"sto \"&partije!$E$138)","v":""},{"$f":"$S$14","v":1},{"$f":"$T$14","v":4}]
[{"$f":"IF(ISBLANK(partije!D139),\"\",partije!D139)","v":""},{"$f":"IF(ISBLANK(partije!E139),\"\",partije!E139)","v":""},{"$f":"INDEX(D33:D36,MATCH(S43,A33:A36,0))","v":"Kalinić Ilija"},{"$f":"INDEX(D33:D36,MATCH(T43,A33:A36,0))","v":"Velinović Miloš"},{"$f":"IF(ISBLANK(partije!J139),\"\",partije!J139)","v":"w"},{"$f":"IF(ISBLANK(partije!K139),\"\",partije!K139)","v":0},{"$f":"IF(ISBLANK(partije!L139),\"\",partije!L139)","v":""},null,{"$f":"IF(ISBLANK(partije!M139),\"\",partije!M139)","v":""},null,{"$f":"IF(ISBLANK(partije!N139),\"\",partije!N139)","v":""},null,{"$f":"IF(ISBLANK(partije!O139),\"\",partije!O139)","v":""},{"$f":"IF(ISBLANK(partije!P139),\"\",partije!P139)","v":""},{"$f":"IF(ISBLANK(partije!Q139),\"\",partije!Q139)","v":""},{"$f":"IF(ISBLANK(partije!R139),\"\",partije!R139)","v":""},{"$f":"IF(ISBLANK(partije!$D$139),\"\",partije!$D$139)","v":""},{"$f":"IF(ISBLANK(partije!$E$139),\"\",\"sto \"&partije!$E$139)","v":""},{"$f":"$S$15","v":2},{"$f":"$T$15","v":3}]
[]
[{"$nulls":3},"grupa 4"]
[null,"br.",null,"igrač",1,null,2,null,3,null,4,null,"pobede","porazi","mesto",null,"plasman grupe 4"]
[1,{"v":41,"d":"4-1"},{"$f":"IF(ISNA(MATCH(B47,spisak!$F$4:$F$308,0)),\"\",INDEX(spisak!$C$4:$C$308,MATCH(B47,spisak!$F$4:$F$308,0)))","v":"Stak Zemun"},{"$f":"IF(ISNA(MATCH(B47,spisak!$F$4:$F$308,0)),\"bye\",INDEX(spisak!$B$4:$B$308,MATCH(B47,spisak!$F$4:$F$308,0)))","v":"Pavlović Dušan"},null,null,{"$f":"INDEX(E52:E57,MATCH(D47&D48,C52:C57&D52:D57,0))&\"/\"&INDEX(F52:F57,MATCH(D47&D48,C52:C57&D52:D57,0))","v":"3/0"},null,{"$f":"INDEX(E52:E57,MATCH(D47&D49,C52:C57&D52:D57,0))&\"/\"&INDEX(F52:F57,MATCH(D47&D49,C52:C57&D52:D57,0))","v":"3/0"},null,{"$f":"INDEX(E52:E57,MATCH(D47&D50,C52:C57&D52:D57,0))&\"/\"&INDEX(F52:F57,MATCH(D47&D50,C52:C57&D52:D57,0))","v":"/"},null,{"$f":"IF(ISBLANK(partije!$J$2),\"\",COUNTIFS(C52:C57,D47,E52:E57,3)+COUNTIFS(D52:D57,D47,F52:F57,3))","v":2},{"$f":"IF(ISBLANK(partije!$J$2),\"\",COUNTIFS(C52:C57,D47,E52:E57,\"<3\")+COUNTIFS(D52:D57,D47,F52:F57,\"<3\"))","v":0},1,1,{"$f":"IF(ISBLANK(D47),\"*\",INDEX(D47:D50,MATCH(P47,O47:O50,0)))","v":"Pavlović Dušan"}]
[2,{"v":42,"d":"4-2"},{"$f":"IF(ISNA(MATCH(B48,spisak!$F$4:$F$308,0)),\"\",INDEX(spisak!$C$4:$C$308,MATCH(B48,spisak!$F$4:$F$308,0)))","v":"Sinđelić Beograd"},{"$f":"IF(ISNA(MATCH(B48,spisak!$F$4:$F$308,0)),\"bye\",INDEX(spisak!$B$4:$B$308,MATCH(B48,spisak!$F$4:$F$308,0)))","v":"Miovčić Mihailo"},{"$f":"INDEX(F52:F57,MATCH(D47&D48,C52:C57&D52:D57,0))&\"/\"&INDEX(E52:E57,MATCH(D47&D48,C52:C57&D52:D57,0))","v":"0/3"},{"$nulls":3},{"$f":"INDEX(E52:E57,MATCH(D48&D49,C52:C57&D52:D57,0))&\"/\"&INDEX(F52:F57,MATCH(D48&D49,C52:C57&D52:D57,0))","v":"3/0"},null,{"$f":"INDEX(E52:E57,MATCH(D48&D50,C52:C57&D52:D57,0))&\"/\"&INDEX(F52:F57,MATCH(D48&D50,C52:C57&D52:D57,0))","v":"/"},null,{"$f":"IF(ISBLANK(partije!$J$2),\"\",COUNTIFS(C52:C57,D48,E52:E57,3)+COUNTIFS(D52:D57,D48,F52:F57,3))","v":1},{"$f":"IF(ISBLANK(partije!$J$2),\"\",COUNTIFS(C52:C57,D48,E52:E57,\"<3\")+COUNTIFS(D52:D57,D48,F52:F57,\"<3\"))","v":1},2,2,{"$f":"IF(ISBLANK(D48),\"*\",INDEX(D47:D50,MATCH(P48,O47:O50,0)))","v":"Miovčić Mihailo"}]
[3,{"v":43,"d":"4-3"},{"$f":"IF(ISNA(MATCH(B49,spisak!$F$4:$F$308,0)),\"\",INDEX(spisak!$C$4:$C$308,MATCH(B49,spisak!$F$4:$F$308,0)))","v":"Borac Čačak"},{"$f":"IF(ISNA(MATCH(B49,spisak!$F$4:$F$308,0)),\"bye\",INDEX(spisak!$B$4:$B$308,MATCH(B49,spisak!$F$4:$F$308,0)))","v":"Dragin Luka"},{"$f":"INDEX(F52:F57,MATCH(D47&D49,C52:C57&D52:D57,0))&\"/\"&INDEX(E52:E57,MATCH(D47&D49,C52:C57&D52:D57,0))","v":"0/3"},null,{"$f":"INDEX(F52:F57,MATCH(D48&D49,C52:C57&D52:D57,0))&\"/\"&INDEX(E52:E57,MATCH(D48&D49,C52:C57&D52:D57,0))","v":"0/3"},{"$nulls":3},{"$f":"INDEX(E52:E57,MATCH(D49&D50,C52:C57&D52:D57,0))&\"/\"&INDEX(F52:F57,MATCH(D49&D50,C52:C57&D52:D57,0))","v":"/"},null,{"$f":"IF(ISBLANK(partije!$J$2),\"\",COUNTIFS(C52:C57,D49,E52:E57,3)+COUNTIFS(D52:D57,D49,F52:F57,3))","v":0},{"$f":"IF(ISBLANK(partije!$J$2),\"\",COUNTIFS(C52:C57,D49,E52:E57,\"<3\")+COUNTIFS(D52:D57,D49,F52:F57,\"<3\"))","v":2},3,3,{"$f":"IF(ISBLANK(D49),\"*\",INDEX(D47:D50,MATCH(P49,O47:O50,0)))","v":"Dragin Luka"}]
[4,{"v":44,"d":"4-4"},{"$f":"IF(ISNA(MATCH(B50,spisak!$F$4:$F$308,0)),\"\",INDEX(spisak!$C$4:$C$308,MATCH(B50,spisak!$F$4:$F$308,0)))","v":""},{"$f":"IF(ISNA(MATCH(B50,spisak!$F$4:$F$308,0)),\"bye\",INDEX(spisak!$B$4:$B$308,MATCH(B50,spisak!$F$4:$F$308,0)))","v":"bye"},{"$f":"INDEX(F52:F57,MATCH(D47&D50,C52:C57&D52:D57,0))&\"/\"&INDEX(E52:E57,MATCH(D47&D50,C52:C57&D52:D57,0))","v":"/"},null,{"$f":"INDEX(F52:F57,MATCH(D48&D50,C52:C57&D52:D57,0))&\"/\"&INDEX(E52:E57,MATCH(D48&D50,C52:C57&D52:D57,0))","v":"/"},null,{"$f":"INDEX(F52:F57,MATCH(D49&D50,C52:C57&D52:D57,0))&\"/\"&INDEX(E52:E57,MATCH(D49&D50,C52:C57&D52:D57,0))","v":"/"},{"$nulls":3},{"$f":"IF(ISBLANK(partije!$J$2),\"\",COUNTIFS(C52:C57,D50,E52:E57,3)+COUNTIFS(D52:D57,D50,F52:F57,3))","v":0},{"$f":"IF(ISBLANK(partije!$J$2),\"\",COUNTIFS(C52:C57,D50,E52:E57,\"<3\")+COUNTIFS(D52:D57,D50,F52:F57,\"<3\"))","v":0},null,4,{"$f":"IF(ISBLANK(D50),\"*\",INDEX(D47:D50,MATCH(P50,O47:O50,0)))","v":{"$error":"#N/A"}}]
[{"$nulls":4},"rezultat",null,"set1",null,"set 2",null,"set 3",null,"set 4","set 5","set 6","set 7",null,null,"berger4"]
[{"$f":"IF(ISBLANK(partije!D8),\"\",partije!D8)","v":""},{"$f":"IF(ISBLANK(partije!E8),\"\",partije!E8)","v":""},{"$f":"INDEX(D47:D50,MATCH(S52,A47:A50,0))","v":"Pavlović Dušan"},{"$f":"INDEX(D47:D50,MATCH(T52,A47:A50,0))","v":"Dragin Luka"},{"$f":"IF(ISBLANK(partije!J8),\"\",partije!J8)","v":3},{"$f":"IF(ISBLANK(partije!K8),\"\",partije!K8)","v":0},{"$f":"IF(ISBLANK(partije!L8),\"\",partije!L8)","v":{"v":1103,"d":"11-03"}},null,{"$f":"IF(ISBLANK(partije!M8),\"\",partije!M8)","v":{"v":1102,"d":"11-02"}},null,{"$f":"IF(ISBLANK(partije!N8),\"\",partije!N8)","v":{"v":1101,"d":"11-01"}},{"$f":"IF(ISBLANK(partije!M44),\"\",partije!M44)","v":""},{"$f":"IF(ISBLANK(partije!O8),\"\",partije!O8)","v":""},{"$f":"IF(ISBLANK(partije!P8),\"\",partije!P8)","v":""},{"$f":"IF(ISBLANK(partije!Q8),\"\",partije!Q8)","v":""},{"$f":"IF(ISBLANK(partije!R8),\"\",partije!R8)","v":""},{"$f":"IF(ISBLANK(partije!$D$8),\"\",partije!$D$8)","v":""},{"$f":"IF(ISBLANK(partije!$E$8),\"\",\"sto \"&partije!$E$8)","v":""},{"$f":"$S$10","v":1},{"$f":"$T$10","v":3}]
[{"$f":"IF(ISBLANK(partije!D9),\"\",partije!D9)","v":""},{"$f":"IF(ISBLANK(partije!E9),\"\",partije!E9)","v":""},{"$f":"INDEX(D47:D50,MATCH(S53,A47:A50,0))","v":"Miovčić Mihailo"},{"$f":"INDEX(D47:D50,MATCH(T53,A47:A50,0))","v":"bye"},{"$f":"IF(ISBLANK(partije!J9),\"\",partije!J9)","v":""},{"$f":"IF(ISBLANK(partije!K9),\"\",partije!K9)","v":""},{"$f":"IF(ISBLANK(partije!L9),\"\",partije!L9)","v":""},null,{"$f":"IF(ISBLANK(partije!M9),\"\",partije!M9)","v":""},null,{"$f":"IF(ISBLANK(partije!N9),\"\",partije!N9)","v":""},{"$f":"IF(ISBLANK(partije!M45),\"\",partije!M45)","v":""},{"$f":"IF(ISBLANK(partije!O9),\"\",partije!O9)","v":""},{"$f":"IF(ISBLANK(partije!P9),\"\",partije!P9)","v":""},{"$f":"IF(ISBLANK(partije!Q9),\"\",partije!Q9)","v":""},{"$f":"IF(ISBLANK(partije!R9),\"\",partije!R9)","v":""},{"$f":"IF(ISBLANK(partije!$D$9),\"\",partije!$D$9)","v":""},{"$f":"IF(ISBLANK(partije!$E$9),\"\",\"sto \"&partije!$E$9)","v":""},{"$f":"$S$11","v":2},{"$f":"$T$11","v":4}]
[{"$f":"IF(ISBLANK(partije!D74),\"\",partije!D74)","v":""},{"$f":"IF(ISBLANK(partije!E74),\"\",partije!E74)","v":""},{"$f":"INDEX(D47:D50,MATCH(S54,A47:A50,0))","v":"Pavlović Dušan"},{"$f":"INDEX(D47:D50,MATCH(T54,A47:A50,0))","v":"Miovčić Mihailo"},{"$f":"IF(ISBLANK(partije!J74),\"\",partije!J74)","v":3},{"$f":"IF(ISBLANK(partije!K74),\"\",partije!K74)","v":0},{"$f":"IF(ISBLANK(partije!L74),\"\",partije!L74)","v":{"v":1102,"d":"11-02"}},null,{"$f":"IF(ISBLANK(partije!M74),\"\",partije!M74)","v":{"v":1103,"d":"11-03"}},null,{"$f":"IF(ISBLANK(partije!N74),\"\",partije!N74)","v":{"v":1104,"d":"11-04"}},{"$f":"IF(ISBLANK(partije!M46),\"\",partije!M46)","v":""},{"$f":"IF(ISBLANK(partije!O74),\"\",partije!O74)","v":""},{"$f":"IF(ISBLANK(partije!P74),\"\",partije!P74)","v":""},{"$f":"IF(ISBLANK(partije!Q74),\"\",partije!Q74)","v":""},{"$f":"IF(ISBLANK(partije!R74),\"\",partije!R74)","v":""},{"$f":"IF(ISBLANK(partije!$D$74),\"\",partije!$D$74)","v":""},{"$f":"IF(ISBLANK(partije!$E$74),\"\",\"sto \"&partije!$E$74)","v":""},{"$f":"$S$12","v":1},{"$f":"$T$12","v":2}]
[{"$f":"IF(ISBLANK(partije!D75),\"\",partije!D75)","v":""},{"$f":"IF(ISBLANK(partije!E75),\"\",partije!E75)","v":""},{"$f":"INDEX(D47:D50,MATCH(S55,A47:A50,0))","v":"Dragin Luka"},{"$f":"INDEX(D47:D50,MATCH(T55,A47:A50,0))","v":"bye"},{"$f":"IF(ISBLANK(partije!J75),\"\",partije!J75)","v":""},{"$f":"IF(ISBLANK(partije!K75),\"\",partije!K75)","v":""},{"$f":"IF(ISBLANK(partije!L75),\"\",partije!L75)","v":""},null,{"$f":"IF(ISBLANK(partije!M75),\"\",partije!M75)","v":""},null,{"$f":"IF(ISBLANK(partije!N75),\"\",partije!N75)","v":""},{"$f":"IF(ISBLANK(partije!M47),\"\",partije!M47)","v":""},{"$f":"IF(ISBLANK(partije!O75),\"\",partije!O75)","v":""},{"$f":"IF(ISBLANK(partije!P75),\"\",partije!P75)","v":""},{"$f":"IF(ISBLANK(partije!Q75),\"\",partije!Q75)","v":""},{"$f":"IF(ISBLANK(partije!R75),\"\",partije!R75)","v":""},{"$f":"IF(ISBLANK(partije!$D$75),\"\",partije!$D$75)","v":""},{"$f":"IF(ISBLANK(partije!$E$75),\"\",\"sto \"&partije!$E$75)","v":""},{"$f":"$S$13","v":3},{"$f":"$T$13","v":4}]
[{"$f":"IF(ISBLANK(partije!D140),\"\",partije!D140)","v":""},{"$f":"IF(ISBLANK(partije!E140),\"\",partije!E140)","v":""},{"$f":"INDEX(D47:D50,MATCH(S56,A47:A50,0))","v":"Pavlović Dušan"},{"$f":"INDEX(D47:D50,MATCH(T56,A47:A50,0))","v":"bye"},{"$f":"IF(ISBLANK(partije!J140),\"\",partije!J140)","v":""},{"$f":"IF(ISBLANK(partije!K140),\"\",partije!K140)","v":""},{"$f":"IF(ISBLANK(partije!L140),\"\",partije!L140)","v":""},null,{"$f":"IF(ISBLANK(partije!M140),\"\",partije!M140)","v":""},null,{"$f":"IF(ISBLANK(partije!N140),\"\",partije!N140)","v":""},{"$f":"IF(ISBLANK(partije!M48),\"\",partije!M48)","v":""},{"$f":"IF(ISBLANK(partije!O140),\"\",partije!O140)","v":""},{"$f":"IF(ISBLANK(partije!P140),\"\",partije!P140)","v":""},{"$f":"IF(ISBLANK(partije!Q140),\"\",partije!Q140)","v":""},{"$f":"IF(ISBLANK(partije!R140),\"\",partije!R140)","v":""},{"$f":"IF(ISBLANK(partije!$D$140),\"\",partije!$D$140)","v":""},{"$f":"IF(ISBLANK(partije!$E$140),\"\",\"sto \"&partije!$E$140)","v":""},{"$f":"$S$14","v":1},{"$f":"$T$14","v":4}]
[{"$f":"IF(ISBLANK(partije!D141),\"\",partije!D141)","v":""},{"$f":"IF(ISBLANK(partije!E141),\"\",partije!E141)","v":""},{"$f":"INDEX(D47:D50,MATCH(S57,A47:A50,0))","v":"Miovčić Mihailo"},{"$f":"INDEX(D47:D50,MATCH(T57,A47:A50,0))","v":"Dragin Luka"},{"$f":"IF(ISBLANK(partije!J141),\"\",partije!J141)","v":3},{"$f":"IF(ISBLANK(partije!K141),\"\",partije!K141)","v":0},{"$f":"IF(ISBLANK(partije!L141),\"\",partije!L141)","v":{"v":1103,"d":"11-03"}},null,{"$f":"IF(ISBLANK(partije!M141),\"\",partije!M141)","v":{"v":1103,"d":"11-03"}},null,{"$f":"IF(ISBLANK(partije!N141),\"\",partije!N141)","v":{"v":1106,"d":"11-06"}},{"$f":"IF(ISBLANK(partije!M49),\"\",partije!M49)","v":""},{"$f":"IF(ISBLANK(partije!O141),\"\",partije!O141)","v":""},{"$f":"IF(ISBLANK(partije!P141),\"\",partije!P141)","v":""},{"$f":"IF(ISBLANK(partije!Q141),\"\",partije!Q141)","v":""},{"$f":"IF(ISBLANK(partije!R141),\"\",partije!R141)","v":""},{"$f":"IF(ISBLANK(partije!$D$141),\"\",partije!$D$141)","v":""},{"$f":"IF(ISBLANK(partije!$E$141),\"\",\"sto \"&partije!$E$141)","v":""},{"$f":"$S$15","v":2},{"$f":"$T$15","v":3}]
[]
[{"$nulls":3},"grupa 5"]
[null,"br.",null,"igrač",1,null,2,null,3,null,4,null,"pobede","porazi","mesto",null,"plasman grupe 5"]
[1,{"v":51,"d":"5-1"},{"$f":"IF(ISNA(MATCH(B61,spisak!$F$4:$F$308,0)),\"\",INDEX(spisak!$C$4:$C$308,MATCH(B61,spisak!$F$4:$F$308,0)))","v":"Crvena Zvezda Beograd"},{"$f":"IF(ISNA(MATCH(B61,spisak!$F$4:$F$308,0)),\"bye\",INDEX(spisak!$B$4:$B$308,MATCH(B61,spisak!$F$4:$F$308,0)))","v":"Jelikić Dimitrije"},null,null,{"$f":"INDEX(E66:E71,MATCH(D61&D62,C66:C71&D66:D71,0))&\"/\"&INDEX(F66:F71,MATCH(D61&D62,C66:C71&D66:D71,0))","v":"3/0"},null,{"$f":"INDEX(E66:E71,MATCH(D61&D63,C66:C71&D66:D71,0))&\"/\"&INDEX(F66:F71,MATCH(D61&D63,C66:C71&D66:D71,0))","v":"3/0"},null,{"$f":"INDEX(E66:E71,MATCH(D61&D64,C66:C71&D66:D71,0))&\"/\"&INDEX(F66:F71,MATCH(D61&D64,C66:C71&D66:D71,0))","v":"/"},null,{"$f":"IF(ISBLANK(partije!$J$2),\"\",COUNTIFS(C66:C71,D61,E66:E71,3)+COUNTIFS(D66:D71,D61,F66:F71,3))","v":2},{"$f":"IF(ISBLANK(partije!$J$2),\"\",COUNTIFS(C66:C71,D61,E66:E71,\"<3\")+COUNTIFS(D66:D71,D61,F66:F71,\"<3\"))","v":0},1,1,{"$f":"IF(ISBLANK(D61),\"*\",INDEX(D61:D64,MATCH(P61,O61:O64,0)))","v":"Jelikić Dimitrije"}]
[2,{"v":52,"d":"5-2"},{"$f":"IF(ISNA(MATCH(B62,spisak!$F$4:$F$308,0)),\"\",INDEX(spisak!$C$4:$C$308,MATCH(B62,spisak!$F$4:$F$308,0)))","v":"Sinđelić Beograd"},{"$f":"IF(ISNA(MATCH(B62,spisak!$F$4:$F$308,0)),\"bye\",INDEX(spisak!$B$4:$B$308,MATCH(B62,spisak!$F$4:$F$308,0)))","v":"Kalinčević Vladimir"},{"$f":"INDEX(F66:F71,MATCH(D61&D62,C66:C71&D66:D71,0))&\"/\"&INDEX(E66:E71,MATCH(D61&D62,C66:C71&D66:D71,0))","v":"0/3"},{"$nulls":3},{"$f":"INDEX(E66:E71,MATCH(D62&D63,C66:C71&D66:D71,0))&\"/\"&INDEX(F66:F71,MATCH(D62&D63,C66:C71&D66:D71,0))","v":"3/0"},null,{"$f":"INDEX(E66:E71,MATCH(D62&D64,C66:C71&D66:D71,0))&\"/\"&INDEX(F66:F71,MATCH(D62&D64,C66:C71&D66:D71,0))","v":"/"},null,{"$f":"IF(ISBLANK(partije!$J$2),\"\",COUNTIFS(C66:C71,D62,E66:E71,3)+COUNTIFS(D66:D71,D62,F66:F71,3))","v":1},{"$f":"IF(ISBLANK(partije!$J$2),\"\",COUNTIFS(C66:C71,D62,E66:E71,\"<3\")+COUNTIFS(D66:D71,D62,F66:F71,\"<3\"))","v":1},2,2,{"$f":"IF(ISBLANK(D62),\"*\",INDEX(D61:D64,MATCH(P62,O61:O64,0)))","v":"Kalinčević Vladimir"}]
[3,{"v":53,"d":"5-3"},{"$f":"IF(ISNA(MATCH(B63,spisak!$F$4:$F$308,0)),\"\",INDEX(spisak!$C$4:$C$308,MATCH(B63,spisak!$F$4:$F$308,0)))","v":"Lala"},{"$f":"IF(ISNA(MATCH(B63,spisak!$F$4:$F$308,0)),\"bye\",INDEX(spisak!$B$4:$B$308,MATCH(B63,spisak!$F$4:$F$308,0)))","v":"Janićijević Ognjen"},{"$f":"INDEX(F66:F71,MATCH(D61&D63,C66:C71&D66:D71,0))&\"/\"&INDEX(E66:E71,MATCH(D61&D63,C66:C71&D66:D71,0))","v":"0/3"},null,{"$f":"INDEX(F66:F71,MATCH(D62&D63,C66:C71&D66:D71,0))&\"/\"&INDEX(E66:E71,MATCH(D62&D63,C66:C71&D66:D71,0))","v":"0/3"},{"$nulls":3},{"$f":"INDEX(E66:E71,MATCH(D63&D64,C66:C71&D66:D71,0))&\"/\"&INDEX(F66:F71,MATCH(D63&D64,C66:C71&D66:D71,0))","v":"/"},null,{"$f":"IF(ISBLANK(partije!$J$2),\"\",COUNTIFS(C66:C71,D63,E66:E71,3)+COUNTIFS(D66:D71,D63,F66:F71,3))","v":0},{"$f":"IF(ISBLANK(partije!$J$2),\"\",COUNTIFS(C66:C71,D63,E66:E71,\"<3\")+COUNTIFS(D66:D71,D63,F66:F71,\"<3\"))","v":2},3,3,{"$f":"IF(ISBLANK(D63),\"*\",INDEX(D61:D64,MATCH(P63,O61:O64,0)))","v":"Janićijević Ognjen"}]
[4,{"v":54,"d":"5-4"},{"$f":"IF(ISNA(MATCH(B64,spisak!$F$4:$F$308,0)),\"\",INDEX(spisak!$C$4:$C$308,MATCH(B64,spisak!$F$4:$F$308,0)))","v":""},{"$f":"IF(ISNA(MATCH(B64,spisak!$F$4:$F$308,0)),\"bye\",INDEX(spisak!$B$4:$B$308,MATCH(B64,spisak!$F$4:$F$308,0)))","v":"bye"},{"$f":"INDEX(F66:F71,MATCH(D61&D64,C66:C71&D66:D71,0))&\"/\"&INDEX(E66:E71,MATCH(D61&D64,C66:C71&D66:D71,0))","v":"/"},null,{"$f":"INDEX(F66:F71,MATCH(D62&D64,C66:C71&D66:D71,0))&\"/\"&INDEX(E66:E71,MATCH(D62&D64,C66:C71&D66:D71,0))","v":"/"},null,{"$f":"INDEX(F66:F71,MATCH(D63&D64,C66:C71&D66:D71,0))&\"/\"&INDEX(E66:E71,MATCH(D63&D64,C66:C71&D66:D71,0))","v":"/"},{"$nulls":3},{"$f":"IF(ISBLANK(partije!$J$2),\"\",COUNTIFS(C66:C71,D64,E66:E71,3)+COUNTIFS(D66:D71,D64,F66:F71,3))","v":0},{"$f":"IF(ISBLANK(partije!$J$2),\"\",COUNTIFS(C66:C71,D64,E66:E71,\"<3\")+COUNTIFS(D66:D71,D64,F66:F71,\"<3\"))","v":0},null,4,{"$f":"IF(ISBLANK(D64),\"*\",INDEX(D61:D64,MATCH(P64,O61:O64,0)))","v":{"$error":"#N/A"}}]
[{"$nulls":4},"rezultat",null,"set1",null,"set 2",null,"set 3",null,"set 4","set 5","set 6","set 7",null,null,"berger4"]
[{"$f":"IF(ISBLANK(partije!D10),\"\",partije!D10)","v":""},{"$f":"IF(ISBLANK(partije!E10),\"\",partije!E10)","v":""},{"$f":"INDEX(D61:D64,MATCH(S66,A61:A64,0))","v":"Jelikić Dimitrije"},{"$f":"INDEX(D61:D64,MATCH(T66,A61:A64,0))","v":"Janićijević Ognjen"},{"$f":"IF(ISBLANK(partije!J10),\"\",partije!J10)","v":3},{"$f":"IF(ISBLANK(partije!K10),\"\",partije!K10)","v":0},{"$f":"IF(ISBLANK(partije!L10),\"\",partije!L10)","v":{"v":1104,"d":"11-04"}},null,{"$f":"IF(ISBLANK(partije!M10),\"\",partije!M10)","v":{"v":1102,"d":"11-02"}},null,{"$f":"IF(ISBLANK(partije!N10),\"\",partije!N10)","v":{"v":1103,"d":"11-03"}},{"$f":"IF(ISBLANK(partije!M10),\"\",partije!M10)","v":{"v":1102,"d":"11-02"}},{"$f":"IF(ISBLANK(partije!O10),\"\",partije!O10)","v":""},{"$f":"IF(ISBLANK(partije!P10),\"\",partije!P10)","v":""},{"$f":"IF(ISBLANK(partije!Q10),\"\",partije!Q10)","v":""},{"$f":"IF(ISBLANK(partije!R10),\"\",partije!R10)","v":""},{"$f":"IF(ISBLANK(partije!$D$10),\"\",partije!$D$10)","v":""},{"$f":"IF(ISBLANK(partije!$E$10),\"\",\"sto \"&partije!$E$10)","v":""},{"$f":"$S$10","v":1},{"$f":"$T$10","v":3}]
[{"$f":"IF(ISBLANK(partije!D11),\"\",partije!D11)","v":""},{"$f":"IF(ISBLANK(partije!E11),\"\",partije!E11)","v":""},{"$f":"INDEX(D61:D64,MATCH(S67,A61:A64,0))","v":"Kalinčević Vladimir"},{"$f":"INDEX(D61:D64,MATCH(T67,A61:A64,0))","v":"bye"},{"$f":"IF(ISBLANK(partije!J11),\"\",partije!J11)","v":""},{"$f":"IF(ISBLANK(partije!K11),\"\",partije!K11)","v":""},{"$f":"IF(ISBLANK(partije!L11),\"\",partije!L11)","v":""},null,{"$f":"IF(ISBLANK(partije!M11),\"\",partije!M11)","v":""},null,{"$f":"IF(ISBLANK(partije!N11),\"\",partije!N11)","v":""},{"$f":"IF(ISBLANK(partije!M11),\"\",partije!M11)","v":""},{"$f":"IF(ISBLANK(partije!O11),\"\",partije!O11)","v":""},{"$f":"IF(ISBLANK(partije!P11),\"\",partije!P11)","v":""},{"$f":"IF(ISBLANK(partije!Q11),\"\",partije!Q11)","v":""},{"$f":"IF(ISBLANK(partije!R11),\"\",partije!R11)","v":""},{"$f":"IF(ISBLANK(partije!$D$11),\"\",partije!$D$11)","v":""},{"$f":"IF(ISBLANK(partije!$E$11),\"\",\"sto \"&partije!$E$11)","v":""},{"$f":"$S$11","v":2},{"$f":"$T$11","v":4}]
[{"$f":"IF(ISBLANK(partije!D76),\"\",partije!D76)","v":""},{"$f":"IF(ISBLANK(partije!E76),\"\",partije!E76)","v":""},{"$f":"INDEX(D61:D64,MATCH(S68,A61:A64,0))","v":"Jelikić Dimitrije"},{"$f":"INDEX(D61:D64,MATCH(T68,A61:A64,0))","v":"Kalinčević Vladimir"},{"$f":"IF(ISBLANK(partije!J76),\"\",partije!J76)","v":3},{"$f":"IF(ISBLANK(partije!K76),\"\",partije!K76)","v":0},{"$f":"IF(ISBLANK(partije!L76),\"\",partije!L76)","v":{"v":1106,"d":"11-06"}},null,{"$f":"IF(ISBLANK(partije!M76),\"\",partije!M76)","v":{"v":1103,"d":"11-03"}},null,{"$f":"IF(ISBLANK(partije!N76),\"\",partije!N76)","v":{"v":1108,"d":"11-08"}},{"$f":"IF(ISBLANK(partije!M76),\"\",partije!M76)","v":{"v":1103,"d":"11-03"}},{"$f":"IF(ISBLANK(partije!O76),\"\",partije!O76)","v":""},{"$f":"IF(ISBLANK(partije!P76),\"\",partije!P76)","v":""},{"$f":"IF(ISBLANK(partije!Q76),\"\",partije!Q76)","v":""},{"$f":"IF(ISBLANK(partije!R76),\"\",partije!R76)","v":""},{"$f":"IF(ISBLANK(partije!$D$76),\"\",partije!$D$76)","v":""},{"$f":"IF(ISBLANK(partije!$E$76),\"\",\"sto \"&partije!$E$76)","v":""},{"$f":"$S$12","v":1},{"$f":"$T$12","v":2}]
[{"$f":"IF(ISBLANK(partije!D77),\"\",partije!D77)","v":""},{"$f":"IF(ISBLANK(partije!E77),\"\",partije!E77)","v":""},{"$f":"INDEX(D61:D64,MATCH(S69,A61:A64,0))","v":"Janićijević Ognjen"},{"$f":"INDEX(D61:D64,MATCH(T69,A61:A64,0))","v":"bye"},{"$f":"IF(ISBLANK(partije!J77),\"\",partije!J77)","v":""},{"$f":"IF(ISBLANK(partije!K77),\"\",partije!K77)","v":""},{"$f":"IF(ISBLANK(partije!L77),\"\",partije!L77)","v":""},null,{"$f":"IF(ISBLANK(partije!M77),\"\",partije!M77)","v":""},null,{"$f":"IF(ISBLANK(partije!N77),\"\",partije!N77)","v":""},{"$f":"IF(ISBLANK(partije!M77),\"\",partije!M77)","v":""},{"$f":"IF(ISBLANK(partije!O77),\"\",partije!O77)","v":""},{"$f":"IF(ISBLANK(partije!P77),\"\",partije!P77)","v":""},{"$f":"IF(ISBLANK(partije!Q77),\"\",partije!Q77)","v":""},{"$f":"IF(ISBLANK(partije!R77),\"\",partije!R77)","v":""},{"$f":"IF(ISBLANK(partije!$D$77),\"\",partije!$D$77)","v":""},{"$f":"IF(ISBLANK(partije!$E$77),\"\",\"sto \"&partije!$E$77)","v":""},{"$f":"$S$13","v":3},{"$f":"$T$13","v":4}]
[{"$f":"IF(ISBLANK(partije!D142),\"\",partije!D142)","v":""},{"$f":"IF(ISBLANK(partije!E142),\"\",partije!E142)","v":""},{"$f":"INDEX(D61:D64,MATCH(S70,A61:A64,0))","v":"Jelikić Dimitrije"},{"$f":"INDEX(D61:D64,MATCH(T70,A61:A64,0))","v":"bye"},{"$f":"IF(ISBLANK(partije!J142),\"\",partije!J142)","v":""},{"$f":"IF(ISBLANK(partije!K142),\"\",partije!K142)","v":""},{"$f":"IF(ISBLANK(partije!L142),\"\",partije!L142)","v":""},null,{"$f":"IF(ISBLANK(partije!M142),\"\",partije!M142)","v":""},null,{"$f":"IF(ISBLANK(partije!N142),\"\",partije!N142)","v":""},{"$f":"IF(ISBLANK(partije!M142),\"\",partije!M142)","v":""},{"$f":"IF(ISBLANK(partije!O142),\"\",partije!O142)","v":""},{"$f":"IF(ISBLANK(partije!P142),\"\",partije!P142)","v":""},{"$f":"IF(ISBLANK(partije!Q142),\"\",partije!Q142)","v":""},{"$f":"IF(ISBLANK(partije!R142),\"\",partije!R142)","v":""},{"$f":"IF(ISBLANK(partije!$D$142),\"\",partije!$D$142)","v":""},{"$f":"IF(ISBLANK(partije!$E$142),\"\",\"sto \"&partije!$E$142)","v":""},{"$f":"$S$14","v":1},{"$f":"$T$14","v":4}]
[{"$f":"IF(ISBLANK(partije!D143),\"\",partije!D143)","v":""},{"$f":"IF(ISBLANK(partije!E143),\"\",partije!E143)","v":""},{"$f":"INDEX(D61:D64,MATCH(S71,A61:A64,0))","v":"Kalinčević Vladimir"},{"$f":"INDEX(D61:D64,MATCH(T71,A61:A64,0))","v":"Janićijević Ognjen"},{"$f":"IF(ISBLANK(partije!J143),\"\",partije!J143)","v":3},{"$f":"IF(ISBLANK(partije!K143),\"\",partije!K143)","v":0},{"$f":"IF(ISBLANK(partije!L143),\"\",partije!L143)","v":{"v":1105,"d":"11-05"}},null,{"$f":"IF(ISBLANK(partije!M143),\"\",partije!M143)","v":{"v":1103,"d":"11-03"}},null,{"$f":"IF(ISBLANK(partije!N143),\"\",partije!N143)","v":{"v":1108,"d":"11-08"}},{"$f":"IF(ISBLANK(partije!M143),\"\",partije!M143)","v":{"v":1103,"d":"11-03"}},{"$f":"IF(ISBLANK(partije!O143),\"\",partije!O143)","v":""},{"$f":"IF(ISBLANK(partije!P143),\"\",partije!P143)","v":""},{"$f":"IF(ISBLANK(partije!Q143),\"\",partije!Q143)","v":""},{"$f":"IF(ISBLANK(partije!R143),\"\",partije!R143)","v":""},{"$f":"IF(ISBLANK(partije!$D$143),\"\",partije!$D$143)","v":""},{"$f":"IF(ISBLANK(partije!$E$143),\"\",\"sto \"&partije!$E$143)","v":""},{"$f":"$S$15","v":2},{"$f":"$T$15","v":3}]
[]
[{"$nulls":3},"grupa 6"]
[null,"br.",null,"igrač",1,null,2,null,3,null,4,null,"pobede","porazi","mesto",null,"plasman grupe 6"]
[1,{"v":61,"d":"6-1"},{"$f":"IF(ISNA(MATCH(B75,spisak!$F$4:$F$308,0)),\"\",INDEX(spisak!$C$4:$C$308,MATCH(B75,spisak!$F$4:$F$308,0)))","v":"Temerin"},{"$f":"IF(ISNA(MATCH(B75,spisak!$F$4:$F$308,0)),\"bye\",INDEX(spisak!$B$4:$B$308,MATCH(B75,spisak!$F$4:$F$308,0)))","v":"Varga Danijel"},null,null,{"$f":"INDEX(E80:E85,MATCH(D75&D76,C80:C85&D80:D85,0))&\"/\"&INDEX(F80:F85,MATCH(D75&D76,C80:C85&D80:D85,0))","v":"3/0"},null,{"$f":"INDEX(E80:E85,MATCH(D75&D77,C80:C85&D80:D85,0))&\"/\"&INDEX(F80:F85,MATCH(D75&D77,C80:C85&D80:D85,0))","v":"3/0"},null,{"$f":"INDEX(E80:E85,MATCH(D75&D78,C80:C85&D80:D85,0))&\"/\"&INDEX(F80:F85,MATCH(D75&D78,C80:C85&D80:D85,0))","v":"/"},null,{"$f":"IF(ISBLANK(partije!$J$2),\"\",COUNTIFS(C80:C85,D75,E80:E85,3)+COUNTIFS(D80:D85,D75,F80:F85,3))","v":2},{"$f":"IF(ISBLANK(partije!$J$2),\"\",COUNTIFS(C80:C85,D75,E80:E85,\"<3\")+COUNTIFS(D80:D85,D75,F80:F85,\"<3\"))","v":0},1,1,{"$f":"IF(ISBLANK(D75),\"*\",INDEX(D75:D78,MATCH(P75,O75:O78,0)))","v":"Varga Danijel"}]
[2,{"v":62,"d":"6-2"},{"$f":"IF(ISNA(MATCH(B76,spisak!$F$4:$F$308,0)),\"\",INDEX(spisak!$C$4:$C$308,MATCH(B76,spisak!$F$4:$F$308,0)))","v":"Doža"},{"$f":"IF(ISNA(MATCH(B76,spisak!$F$4:$F$308,0)),\"bye\",INDEX(spisak!$B$4:$B$308,MATCH(B76,spisak!$F$4:$F$308,0)))","v":"Marton Filip"},{"$f":"INDEX(F80:F85,MATCH(D75&D76,C80:C85&D80:D85,0))&\"/\"&INDEX(E80:E85,MATCH(D75&D76,C80:C85&D80:D85,0))","v":"0/3"},{"$nulls":3},{"$f":"INDEX(E80:E85,MATCH(D76&D77,C80:C85&D80:D85,0))&\"/\"&INDEX(F80:F85,MATCH(D76&D77,C80:C85&D80:D85,0))","v":"2/3"},null,{"$f":"INDEX(E80:E85,MATCH(D76&D78,C80:C85&D80:D85,0))&\"/\"&INDEX(F80:F85,MATCH(D76&D78,C80:C85&D80:D85,0))","v":"/"},null,{"$f":"IF(ISBLANK(partije!$J$2),\"\",COUNTIFS(C80:C85,D76,E80:E85,3)+COUNTIFS(D80:D85,D76,F80:F85,3))","v":0},{"$f":"IF(ISBLANK(partije!$J$2),\"\",COUNTIFS(C80:C85,D76,E80:E85,\"<3\")+COUNTIFS(D80:D85,D76,F80:F85,\"<3\"))","v":2},3,2,{"$f":"IF(ISBLANK(D76),\"*\",INDEX(D75:D78,MATCH(P76,O75:O78,0)))","v":"Preslav Nikolov"}]
[3,{"v":63,"d":"6-3"},{"$f":"IF(ISNA(MATCH(B77,spisak!$F$4:$F$308,0)),\"\",INDEX(spisak!$C$4:$C$308,MATCH(B77,spisak!$F$4:$F$308,0)))","v":"Bdinci Bugarska"},{"$f":"IF(ISNA(MATCH(B77,spisak!$F$4:$F$308,0)),\"bye\",INDEX(spisak!$B$4:$B$308,MATCH(B77,spisak!$F$4:$F$308,0)))","v":"Preslav Nikolov"},{"$f":"INDEX(F80:F85,MATCH(D75&D77,C80:C85&D80:D85,0))&\"/\"&INDEX(E80:E85,MATCH(D75&D77,C80:C85&D80:D85,0))","v":"0/3"},null,{"$f":"INDEX(F80:F85,MATCH(D76&D77,C80:C85&D80:D85,0))&\"/\"&INDEX(E80:E85,MATCH(D76&D77,C80:C85&D80:D85,0))","v":"3/2"},{"$nulls":3},{"$f":"INDEX(E80:E85,MATCH(D77&D78,C80:C85&D80:D85,0))&\"/\"&INDEX(F80:F85,MATCH(D77&D78,C80:C85&D80:D85,0))","v":"/"},null,{"$f":"IF(ISBLANK(partije!$J$2),\"\",COUNTIFS(C80:C85,D77,E80:E85,3)+COUNTIFS(D80:D85,D77,F80:F85,3))","v":1},{"$f":"IF(ISBLANK(partije!$J$2),\"\",COUNTIFS(C80:C85,D77,E80:E85,\"<3\")+COUNTIFS(D80:D85,D77,F80:F85,\"<3\"))","v":1},2,3,{"$f":"IF(ISBLANK(D77),\"*\",INDEX(D75:D78,MATCH(P77,O75:O78,0)))","v":"Marton Filip"}]
[4,{"v":64,"d":"6-4"},{"$f":"IF(ISNA(MATCH(B78,spisak!$F$4:$F$308,0)),\"\",INDEX(spisak!$C$4:$C$308,MATCH(B78,spisak!$F$4:$F$308,0)))","v":""},{"$f":"IF(ISNA(MATCH(B78,spisak!$F$4:$F$308,0)),\"bye\",INDEX(spisak!$B$4:$B$308,MATCH(B78,spisak!$F$4:$F$308,0)))","v":"bye"},{"$f":"INDEX(F80:F85,MATCH(D75&D78,C80:C85&D80:D85,0))&\"/\"&INDEX(E80:E85,MATCH(D75&D78,C80:C85&D80:D85,0))","v":"/"},null,{"$f":"INDEX(F80:F85,MATCH(D76&D78,C80:C85&D80:D85,0))&\"/\"&INDEX(E80:E85,MATCH(D76&D78,C80:C85&D80:D85,0))","v":"/"},null,{"$f":"INDEX(F80:F85,MATCH(D77&D78,C80:C85&D80:D85,0))&\"/\"&INDEX(E80:E85,MATCH(D77&D78,C80:C85&D80:D85,0))","v":"/"},{"$nulls":3},{"$f":"IF(ISBLANK(partije!$J$2),\"\",COUNTIFS(C80:C85,D78,E80:E85,3)+COUNTIFS(D80:D85,D78,F80:F85,3))","v":0},{"$f":"IF(ISBLANK(partije!$J$2),\"\",COUNTIFS(C80:C85,D78,E80:E85,\"<3\")+COUNTIFS(D80:D85,D78,F80:F85,\"<3\"))","v":0},null,4,{"$f":"IF(ISBLANK(D78),\"*\",INDEX(D75:D78,MATCH(P78,O75:O78,0)))","v":{"$error":"#N/A"}}]
[{"$nulls":4},"rezultat",null,"set1",null,"set 2",null,"set 3",null,"set 4","set 5","set 6","set 7",null,null,"berger4"]
[{"$f":"IF(ISBLANK(partije!D12),\"\",partije!D12)","v":""},{"$f":"IF(ISBLANK(partije!E12),\"\",partije!E12)","v":""},{"$f":"INDEX(D75:D78,MATCH(S80,A75:A78,0))","v":"Varga Danijel"},{"$f":"INDEX(D75:D78,MATCH(T80,A75:A78,0))","v":"Preslav Nikolov"},{"$f":"IF(ISBLANK(partije!J12),\"\",partije!J12)","v":3},{"$f":"IF(ISBLANK(partije!K12),\"\",partije!K12)","v":0},{"$f":"IF(ISBLANK(partije!L12),\"\",partije!L12)","v":{"v":1105,"d":"11-05"}},null,{"$f":"IF(ISBLANK(partije!M12),\"\",partije!M12)","v":{"v":1104,"d":"11-04"}},null,{"$f":"IF(ISBLANK(partije!N12),\"\",partije!N12)","v":{"v":1106,"d":"11-06"}},{"$f":"IF(ISBLANK(partije!M12),\"\",partije!M12)","v":{"v":1104,"d":"11-04"}},{"$f":"IF(ISBLANK(partije!O12),\"\",partije!O12)","v":""},{"$f":"IF(ISBLANK(partije!P12),\"\",partije!P12)","v":""},{"$f":"IF(ISBLANK(partije!Q12),\"\",partije!Q12)","v":""},{"$f":"IF(ISBLANK(partije!R12),\"\",partije!R12)","v":""},{"$f":"IF(ISBLANK(partije!$D$12),\"\",partije!$D$12)","v":""},{"$f":"IF(ISBLANK(partije!$E$12),\"\",\"sto \"&partije!$E$12)","v":""},{"$f":"$S$10","v":1},{"$f":"$T$10","v":3}]
[{"$f":"IF(ISBLANK(partije!D13),\"\",partije!D13)","v":""},{"$f":"IF(ISBLANK(partije!E13),\"\",partije!E13)","v":""},{"$f":"INDEX(D75:D78,MATCH(S81,A75:A78,0))","v":"Marton Filip"},{"$f":"INDEX(D75:D78,MATCH(T81,A75:A78,0))","v":"bye"},{"$f":"IF(ISBLANK(partije!J13),\"\",partije!J13)","v":""},{"$f":"IF(ISBLANK(partije!K13),\"\",partije!K13)","v":""},{"$f":"IF(ISBLANK(partije!L13),\"\",partije!L13)","v":""},null,{"$f":"IF(ISBLANK(partije!M13),\"\",partije!M13)","v":""},null,{"$f":"IF(ISBLANK(partije!N13),\"\",partije!N13)","v":""},{"$f":"IF(ISBLANK(partije!M13),\"\",partije!M13)","v":""},{"$f":"IF(ISBLANK(partije!O13),\"\",partije!O13)","v":""},{"$f":"IF(ISBLANK(partije!P13),\"\",partije!P13)","v":""},{"$f":"IF(ISBLANK(partije!Q13),\"\",partije!Q13)","v":""},{"$f":"IF(ISBLANK(partije!R13),\"\",partije!R13)","v":""},{"$f":"IF(ISBLANK(partije!$D$13),\"\",partije!$D$13)","v":""},{"$f":"IF(ISBLANK(partije!$E$13),\"\",\"sto \"&partije!$E$13)","v":""},{"$f":"$S$11","v":2},{"$f":"$T$11","v":4}]
[{"$f":"IF(ISBLANK(partije!D78),\"\",partije!D78)","v":""},{"$f":"IF(ISBLANK(partije!E78),\"\",partije!E78)","v":""},{"$f":"INDEX(D75:D78,MATCH(S82,A75:A78,0))","v":"Varga Danijel"},{"$f":"INDEX(D75:D78,MATCH(T82,A75:A78,0))","v":"Marton Filip"},{"$f":"IF(ISBLANK(partije!J78),\"\",partije!J78)","v":3},{"$f":"IF(ISBLANK(partije!K78),\"\",partije!K78)","v":0},{"$f":"IF(ISBLANK(partije!L78),\"\",partije!L78)","v":{"v":1108,"d":"11-08"}},null,{"$f":"IF(ISBLANK(partije!M78),\"\",partije!M78)","v":{"v":1105,"d":"11-05"}},null,{"$f":"IF(ISBLANK(partije!N78),\"\",partije!N78)","v":{"v":1105,"d":"11-05"}},{"$f":"IF(ISBLANK(partije!M78),\"\",partije!M78)","v":{"v":1105,"d":"11-05"}},{"$f":"IF(ISBLANK(partije!O78),\"\",partije!O78)","v":""},{"$f":"IF(ISBLANK(partije!P78),\"\",partije!P78)","v":""},{"$f":"IF(ISBLANK(partije!Q78),\"\",partije!Q78)","v":""},{"$f":"IF(ISBLANK(partije!R78),\"\",partije!R78)","v":""},{"$f":"IF(ISBLANK(partije!$D$78),\"\",partije!$D$78)","v":""},{"$f":"IF(ISBLANK(partije!$E$78),\"\",\"sto \"&partije!$E$78)","v":""},{"$f":"$S$12","v":1},{"$f":"$T$12","v":2}]
[{"$f":"IF(ISBLANK(partije!D79),\"\",partije!D79)","v":""},{"$f":"IF(ISBLANK(partije!E79),\"\",partije!E79)","v":""},{"$f":"INDEX(D75:D78,MATCH(S83,A75:A78,0))","v":"Preslav Nikolov"},{"$f":"INDEX(D75:D78,MATCH(T83,A75:A78,0))","v":"bye"},{"$f":"IF(ISBLANK(partije!J79),\"\",partije!J79)","v":""},{"$f":"IF(ISBLANK(partije!K79),\"\",partije!K79)","v":""},{"$f":"IF(ISBLANK(partije!L79),\"\",partije!L79)","v":""},null,{"$f":"IF(ISBLANK(partije!M79),\"\",partije!M79)","v":""},null,{"$f":"IF(ISBLANK(partije!N79),\"\",partije!N79)","v":""},{"$f":"IF(ISBLANK(partije!M79),\"\",partije!M79)","v":""},{"$f":"IF(ISBLANK(partije!O79),\"\",partije!O79)","v":""},{"$f":"IF(ISBLANK(partije!P79),\"\",partije!P79)","v":""},{"$f":"IF(ISBLANK(partije!Q79),\"\",partije!Q79)","v":""},{"$f":"IF(ISBLANK(partije!R79),\"\",partije!R79)","v":""},{"$f":"IF(ISBLANK(partije!$D$79),\"\",partije!$D$79)","v":""},{"$f":"IF(ISBLANK(partije!$E$79),\"\",\"sto \"&partije!$E$79)","v":""},{"$f":"$S$13","v":3},{"$f":"$T$13","v":4}]
[{"$f":"IF(ISBLANK(partije!D144),\"\",partije!D144)","v":""},{"$f":"IF(ISBLANK(partije!E144),\"\",partije!E144)","v":""},{"$f":"INDEX(D75:D78,MATCH(S84,A75:A78,0))","v":"Varga Danijel"},{"$f":"INDEX(D75:D78,MATCH(T84,A75:A78,0))","v":"bye"},{"$f":"IF(ISBLANK(partije!J144),\"\",partije!J144)","v":""},{"$f":"IF(ISBLANK(partije!K144),\"\",partije!K144)","v":""},{"$f":"IF(ISBLANK(partije!L144),\"\",partije!L144)","v":""},null,{"$f":"IF(ISBLANK(partije!M144),\"\",partije!M144)","v":""},null,{"$f":"IF(ISBLANK(partije!N144),\"\",partije!N144)","v":""},{"$f":"IF(ISBLANK(partije!M144),\"\",partije!M144)","v":""},{"$f":"IF(ISBLANK(partije!O144),\"\",partije!O144)","v":""},{"$f":"IF(ISBLANK(partije!P144),\"\",partije!P144)","v":""},{"$f":"IF(ISBLANK(partije!Q144),\"\",partije!Q144)","v":""},{"$f":"IF(ISBLANK(partije!R144),\"\",partije!R144)","v":""},{"$f":"IF(ISBLANK(partije!$D$144),\"\",partije!$D$144)","v":""},{"$f":"IF(ISBLANK(partije!$E$144),\"\",\"sto \"&partije!$E$144)","v":""},{"$f":"$S$14","v":1},{"$f":"$T$14","v":4}]
[{"$f":"IF(ISBLANK(partije!D145),\"\",partije!D145)","v":""},{"$f":"IF(ISBLANK(partije!E145),\"\",partije!E145)","v":""},{"$f":"INDEX(D75:D78,MATCH(S85,A75:A78,0))","v":"Marton Filip"},{"$f":"INDEX(D75:D78,MATCH(T85,A75:A78,0))","v":"Preslav Nikolov"},{"$f":"IF(ISBLANK(partije!J145),\"\",partije!J145)","v":2},{"$f":"IF(ISBLANK(partije!K145),\"\",partije!K145)","v":3},{"$f":"IF(ISBLANK(partije!L145),\"\",partije!L145)","v":{"v":1107,"d":"11-07"}},null,{"$f":"IF(ISBLANK(partije!M145),\"\",partije!M145)","v":{"v":811,"d":"08-11"}},null,{"$f":"IF(ISBLANK(partije!N145),\"\",partije!N145)","v":{"v":611,"d":"06-11"}},{"$f":"IF(ISBLANK(partije!M145),\"\",partije!M145)","v":{"v":811,"d":"08-11"}},{"$f":"IF(ISBLANK(partije!O145),\"\",partije!O145)","v":{"v":1109,"d":"11-09"}},{"$f":"IF(ISBLANK(partije!P145),\"\",partije!P145)","v":{"v":611,"d":"06-11"}},{"$f":"IF(ISBLANK(partije!Q145),\"\",partije!Q145)","v":""},{"$f":"IF(ISBLANK(partije!R145),\"\",partije!R145)","v":""},{"$f":"IF(ISBLANK(partije!$D$145),\"\",partije!$D$145)","v":""},{"$f":"IF(ISBLANK(partije!$E$145),\"\",\"sto \"&partije!$E$145)","v":""},{"$f":"$S$15","v":2},{"$f":"$T$15","v":3}]
[]
[{"$nulls":3},"grupa 7"]
[null,"br.",null,"igrač",1,null,2,null,3,null,4,null,"pobede","porazi","mesto",null,"plasman grupe 7"]
[1,{"v":71,"d":"7-1"},{"$f":"IF(ISNA(MATCH(B89,spisak!$F$4:$F$308,0)),\"\",INDEX(spisak!$C$4:$C$308,MATCH(B89,spisak!$F$4:$F$308,0)))","v":"Stak Zemun"},{"$f":"IF(ISNA(MATCH(B89,spisak!$F$4:$F$308,0)),\"bye\",INDEX(spisak!$B$4:$B$308,MATCH(B89,spisak!$F$4:$F$308,0)))","v":"Pavlović Dimitrije"},null,null,{"$f":"INDEX(E94:E99,MATCH(D89&D90,C94:C99&D94:D99,0))&\"/\"&INDEX(F94:F99,MATCH(D89&D90,C94:C99&D94:D99,0))","v":"3/0"},null,{"$f":"INDEX(E94:E99,MATCH(D89&D91,C94:C99&D94:D99,0))&\"/\"&INDEX(F94:F99,MATCH(D89&D91,C94:C99&D94:D99,0))","v":"w/0"},null,{"$f":"INDEX(E94:E99,MATCH(D89&D92,C94:C99&D94:D99,0))&\"/\"&INDEX(F94:F99,MATCH(D89&D92,C94:C99&D94:D99,0))","v":"/"},null,{"$f":"IF(ISBLANK(partije!$J$2),\"\",COUNTIFS(C94:C99,D89,E94:E99,3)+COUNTIFS(D94:D99,D89,F94:F99,3))","v":1},{"$f":"IF(ISBLANK(partije!$J$2),\"\",COUNTIFS(C94:C99,D89,E94:E99,\"<3\")+COUNTIFS(D94:D99,D89,F94:F99,\"<3\"))","v":0},1,1,{"$f":"IF(ISBLANK(D89),\"*\",INDEX(D89:D92,MATCH(P89,O89:O92,0)))","v":"Pavlović Dimitrije"}]
[2,{"v":72,"d":"7-2"},{"$f":"IF(ISNA(MATCH(B90,spisak!$F$4:$F$308,0)),\"\",INDEX(spisak!$C$4:$C$308,MATCH(B90,spisak!$F$4:$F$308,0)))","v":"Borac Čačak"},{"$f":"IF(ISNA(MATCH(B90,spisak!$F$4:$F$308,0)),\"bye\",INDEX(spisak!$B$4:$B$308,MATCH(B90,spisak!$F$4:$F$308,0)))","v":"Dragin Saša"},{"$f":"INDEX(F94:F99,MATCH(D89&D90,C94:C99&D94:D99,0))&\"/\"&INDEX(E94:E99,MATCH(D89&D90,C94:C99&D94:D99,0))","v":"0/3"},{"$nulls":3},{"$f":"INDEX(E94:E99,MATCH(D90&D91,C94:C99&D94:D99,0))&\"/\"&INDEX(F94:F99,MATCH(D90&D91,C94:C99&D94:D99,0))","v":"w/0"},null,{"$f":"INDEX(E94:E99,MATCH(D90&D92,C94:C99&D94:D99,0))&\"/\"&INDEX(F94:F99,MATCH(D90&D92,C94:C99&D94:D99,0))","v":"/"},null,{"$f":"IF(ISBLANK(partije!$J$2),\"\",COUNTIFS(C94:C99,D90,E94:E99,3)+COUNTIFS(D94:D99,D90,F94:F99,3))","v":0},{"$f":"IF(ISBLANK(partije!$J$2),\"\",COUNTIFS(C94:C99,D90,E94:E99,\"<3\")+COUNTIFS(D94:D99,D90,F94:F99,\"<3\"))","v":1},2,2,{"$f":"IF(ISBLANK(D90),\"*\",INDEX(D89:D92,MATCH(P90,O89:O92,0)))","v":"Dragin Saša"}]
[3,{"v":73,"d":"7-3"},{"$f":"IF(ISNA(MATCH(B91,spisak!$F$4:$F$308,0)),\"\",INDEX(spisak!$C$4:$C$308,MATCH(B91,spisak!$F$4:$F$308,0)))","v":"Železničar Niš"},{"$f":"IF(ISNA(MATCH(B91,spisak!$F$4:$F$308,0)),\"bye\",INDEX(spisak!$B$4:$B$308,MATCH(B91,spisak!$F$4:$F$308,0)))","v":"Živadinović Dimitrije"},{"$f":"INDEX(F94:F99,MATCH(D89&D91,C94:C99&D94:D99,0))&\"/\"&INDEX(E94:E99,MATCH(D89&D91,C94:C99&D94:D99,0))","v":"0/w"},null,{"$f":"INDEX(F94:F99,MATCH(D90&D91,C94:C99&D94:D99,0))&\"/\"&INDEX(E94:E99,MATCH(D90&D91,C94:C99&D94:D99,0))","v":"0/w"},{"$nulls":3},{"$f":"INDEX(E94:E99,MATCH(D91&D92,C94:C99&D94:D99,0))&\"/\"&INDEX(F94:F99,MATCH(D91&D92,C94:C99&D94:D99,0))","v":"/"},null,{"$f":"IF(ISBLANK(partije!$J$2),\"\",COUNTIFS(C94:C99,D91,E94:E99,3)+COUNTIFS(D94:D99,D91,F94:F99,3))","v":0},{"$f":"IF(ISBLANK(partije!$J$2),\"\",COUNTIFS(C94:C99,D91,E94:E99,\"<3\")+COUNTIFS(D94:D99,D91,F94:F99,\"<3\"))","v":2},null,3,{"$f":"IF(ISBLANK(D91),\"*\",INDEX(D89:D92,MATCH(P91,O89:O92,0)))","v":{"$error":"#N/A"}}]
[4,{"v":74,"d":"7-4"},{"$f":"IF(ISNA(MATCH(B92,spisak!$F$4:$F$308,0)),\"\",INDEX(spisak!$C$4:$C$308,MATCH(B92,spisak!$F$4:$F$308,0)))","v":""},{"$f":"IF(ISNA(MATCH(B92,spisak!$F$4:$F$308,0)),\"bye\",INDEX(spisak!$B$4:$B$308,MATCH(B92,spisak!$F$4:$F$308,0)))","v":"bye"},{"$f":"INDEX(F94:F99,MATCH(D89&D92,C94:C99&D94:D99,0))&\"/\"&INDEX(E94:E99,MATCH(D89&D92,C94:C99&D94:D99,0))","v":"/"},null,{"$f":"INDEX(F94:F99,MATCH(D90&D92,C94:C99&D94:D99,0))&\"/\"&INDEX(E94:E99,MATCH(D90&D92,C94:C99&D94:D99,0))","v":"/"},null,{"$f":"INDEX(F94:F99,MATCH(D91&D92,C94:C99&D94:D99,0))&\"/\"&INDEX(E94:E99,MATCH(D91&D92,C94:C99&D94:D99,0))","v":"/"},{"$nulls":3},{"$f":"IF(ISBLANK(partije!$J$2),\"\",COUNTIFS(C94:C99,D92,E94:E99,3)+COUNTIFS(D94:D99,D92,F94:F99,3))","v":0},{"$f":"IF(ISBLANK(partije!$J$2),\"\",COUNTIFS(C94:C99,D92,E94:E99,\"<3\")+COUNTIFS(D94:D99,D92,F94:F99,\"<3\"))","v":0},null,4,{"$f":"IF(ISBLANK(D92),\"*\",INDEX(D89:D92,MATCH(P92,O89:O92,0)))","v":{"$error":"#N/A"}}]
[{"$nulls":4},"rezultat",null,"set1",null,"set 2",null,"set 3",null,"set 4","set 5","set 6","set 7",null,null,"berger4"]
[{"$f":"IF(ISBLANK(partije!D14),\"\",partije!D14)","v":""},{"$f":"IF(ISBLANK(partije!E14),\"\",partije!E14)","v":""},{"$f":"INDEX(D89:D92,MATCH(S94,A89:A92,0))","v":"Pavlović Dimitrije"},{"$f":"INDEX(D89:D92,MATCH(T94,A89:A92,0))","v":"Živadinović Dimitrije"},{"$f":"IF(ISBLANK(partije!J14),\"\",partije!J14)","v":"w"},{"$f":"IF(ISBLANK(partije!K14),\"\",partije!K14)","v":0},{"$f":"IF(ISBLANK(partije!L14),\"\",partije!L14)","v":""},null,{"$f":"IF(ISBLANK(partije!M14),\"\",partije!M14)","v":""},null,{"$f":"IF(ISBLANK(partije!N14),\"\",partije!N14)","v":""},{"$f":"IF(ISBLANK(partije!M14),\"\",partije!M14)","v":""},{"$f":"IF(ISBLANK(partije!O14),\"\",partije!O14)","v":""},{"$f":"IF(ISBLANK(partije!P14),\"\",partije!P14)","v":""},{"$f":"IF(ISBLANK(partije!Q14),\"\",partije!Q14)","v":""},{"$f":"IF(ISBLANK(partije!R14),\"\",partije!R14)","v":""},{"$f":"IF(ISBLANK(partije!$D$14),\"\",partije!$D$14)","v":""},{"$f":"IF(ISBLANK(partije!$E$14),\"\",\"sto \"&partije!$E$14)","v":""},{"$f":"$S$10","v":1},{"$f":"$T$10","v":3}]
[{"$f":"IF(ISBLANK(partije!D15),\"\",partije!D15)","v":""},{"$f":"IF(ISBLANK(partije!E15),\"\",partije!E15)","v":""},{"$f":"INDEX(D89:D92,MATCH(S95,A89:A92,0))","v":"Dragin Saša"},{"$f":"INDEX(D89:D92,MATCH(T95,A89:A92,0))","v":"bye"},{"$f":"IF(ISBLANK(partije!J15),\"\",partije!J15)","v":""},{"$f":"IF(ISBLANK(partije!K15),\"\",partije!K15)","v":""},{"$f":"IF(ISBLANK(partije!L15),\"\",partije!L15)","v":""},null,{"$f":"IF(ISBLANK(partije!M15),\"\",partije!M15)","v":""},null,{"$f":"IF(ISBLANK(partije!N15),\"\",partije!N15)","v":""},{"$f":"IF(ISBLANK(partije!M15),\"\",partije!M15)","v":""},{"$f":"IF(ISBLANK(partije!O15),\"\",partije!O15)","v":""},{"$f":"IF(ISBLANK(partije!P15),\"\",partije!P15)","v":""},{"$f":"IF(ISBLANK(partije!Q15),\"\",partije!Q15)","v":""},{"$f":"IF(ISBLANK(partije!R15),\"\",partije!R15)","v":""},{"$f":"IF(ISBLANK(partije!$D$15),\"\",partije!$D$15)","v":""},{"$f":"IF(ISBLANK(partije!$E$15),\"\",\"sto \"&partije!$E$15)","v":""},{"$f":"$S$11","v":2},{"$f":"$T$11","v":4}]
[{"$f":"IF(ISBLANK(partije!D80),\"\",partije!D80)","v":""},{"$f":"IF(ISBLANK(partije!E80),\"\",partije!E80)","v":""},{"$f":"INDEX(D89:D92,MATCH(S96,A89:A92,0))","v":"Pavlović Dimitrije"},{"$f":"INDEX(D89:D92,MATCH(T96,A89:A92,0))","v":"Dragin Saša"},{"$f":"IF(ISBLANK(partije!J80),\"\",partije!J80)","v":3},{"$f":"IF(ISBLANK(partije!K80),\"\",partije!K80)","v":0},{"$f":"IF(ISBLANK(partije!L80),\"\",partije!L80)","v":{"v":1104,"d":"11-04"}},null,{"$f":"IF(ISBLANK(partije!M80),\"\",partije!M80)","v":{"v":1106,"d":"11-06"}},null,{"$f":"IF(ISBLANK(partije!N80),\"\",partije!N80)","v":{"v":1101,"d":"11-01"}},{"$f":"IF(ISBLANK(partije!M80),\"\",partije!M80)","v":{"v":1106,"d":"11-06"}},{"$f":"IF(ISBLANK(partije!O80),\"\",partije!O80)","v":""},{"$f":"IF(ISBLANK(partije!P80),\"\",partije!P80)","v":""},{"$f":"IF(ISBLANK(partije!Q80),\"\",partije!Q80)","v":""},{"$f":"IF(ISBLANK(partije!R80),\"\",partije!R80)","v":""},{"$f":"IF(ISBLANK(partije!$D$80),\"\",partije!$D$80)","v":""},{"$f":"IF(ISBLANK(partije!$E$80),\"\",\"sto \"&partije!$E$80)","v":""},{"$f":"$S$12","v":1},{"$f":"$T$12","v":2}]
[{"$f":"IF(ISBLANK(partije!D81),\"\",partije!D81)","v":""},{"$f":"IF(ISBLANK(partije!E81),\"\",partije!E81)","v":""},{"$f":"INDEX(D89:D92,MATCH(S97,A89:A92,0))","v":"Živadinović Dimitrije"},{"$f":"INDEX(D89:D92,MATCH(T97,A89:A92,0))","v":"bye"},{"$f":"IF(ISBLANK(partije!J81),\"\",partije!J81)","v":""},{"$f":"IF(ISBLANK(partije!K81),\"\",partije!K81)","v":""},{"$f":"IF(ISBLANK(partije!L81),\"\",partije!L81)","v":""},null,{"$f":"IF(ISBLANK(partije!M81),\"\",partije!M81)","v":""},null,{"$f":"IF(ISBLANK(partije!N81),\"\",partije!N81)","v":""},{"$f":"IF(ISBLANK(partije!M81),\"\",partije!M81)","v":""},{"$f":"IF(ISBLANK(partije!O81),\"\",partije!O81)","v":""},{"$f":"IF(ISBLANK(partije!P81),\"\",partije!P81)","v":""},{"$f":"IF(ISBLANK(partije!Q81),\"\",partije!Q81)","v":""},{"$f":"IF(ISBLANK(partije!R81),\"\",partije!R81)","v":""},{"$f":"IF(ISBLANK(partije!$D$81),\"\",partije!$D$81)","v":""},{"$f":"IF(ISBLANK(partije!$E$81),\"\",\"sto \"&partije!$E$81)","v":""},{"$f":"$S$13","v":3},{"$f":"$T$13","v":4}]
[{"$f":"IF(ISBLANK(partije!D146),\"\",partije!D146)","v":""},{"$f":"IF(ISBLANK(partije!E146),\"\",partije!E146)","v":""},{"$f":"INDEX(D89:D92,MATCH(S98,A89:A92,0))","v":"Pavlović Dimitrije"},{"$f":"INDEX(D89:D92,MATCH(T98,A89:A92,0))","v":"bye"},{"$f":"IF(ISBLANK(partije!J146),\"\",partije!J146)","v":""},{"$f":"IF(ISBLANK(partije!K146),\"\",partije!K146)","v":""},{"$f":"IF(ISBLANK(partije!L146),\"\",partije!L146)","v":""},null,{"$f":"IF(ISBLANK(partije!M146),\"\",partije!M146)","v":""},null,{"$f":"IF(ISBLANK(partije!N146),\"\",partije!N146)","v":""},{"$f":"IF(ISBLANK(partije!M146),\"\",partije!M146)","v":""},{"$f":"IF(ISBLANK(partije!O146),\"\",partije!O146)","v":""},{"$f":"IF(ISBLANK(partije!P146),\"\",partije!P146)","v":""},{"$f":"IF(ISBLANK(partije!Q146),\"\",partije!Q146)","v":""},{"$f":"IF(ISBLANK(partije!R146),\"\",partije!R146)","v":""},{"$f":"IF(ISBLANK(partije!$D$146),\"\",partije!$D$146)","v":""},{"$f":"IF(ISBLANK(partije!$E$146),\"\",\"sto \"&partije!$E$146)","v":""},{"$f":"$S$14","v":1},{"$f":"$T$14","v":4}]
[{"$f":"IF(ISBLANK(partije!D147),\"\",partije!D147)","v":""},{"$f":"IF(ISBLANK(partije!E147),\"\",partije!E147)","v":""},{"$f":"INDEX(D89:D92,MATCH(S99,A89:A92,0))","v":"Dragin Saša"},{"$f":"INDEX(D89:D92,MATCH(T99,A89:A92,0))","v":"Živadinović Dimitrije"},{"$f":"IF(ISBLANK(partije!J147),\"\",partije!J147)","v":"w"},{"$f":"IF(ISBLANK(partije!K147),\"\",partije!K147)","v":0},{"$f":"IF(ISBLANK(partije!L147),\"\",partije!L147)","v":""},null,{"$f":"IF(ISBLANK(partije!M147),\"\",partije!M147)","v":""},null,{"$f":"IF(ISBLANK(partije!N147),\"\",partije!N147)","v":""},{"$f":"IF(ISBLANK(partije!M147),\"\",partije!M147)","v":""},{"$f":"IF(ISBLANK(partije!O147),\"\",partije!O147)","v":""},{"$f":"IF(ISBLANK(partije!P147),\"\",partije!P147)","v":""},{"$f":"IF(ISBLANK(partije!Q147),\"\",partije!Q147)","v":""},{"$f":"IF(ISBLANK(partije!R147),\"\",partije!R147)","v":""},{"$f":"IF(ISBLANK(partije!$D$147),\"\",partije!$D$147)","v":""},{"$f":"IF(ISBLANK(partije!$E$147),\"\",\"sto \"&partije!$E$147)","v":""},{"$f":"$S$15","v":2},{"$f":"$T$15","v":3}]
[]
[{"$nulls":3},"grupa 8"]
[null,"br.",null,"igrač",1,null,2,null,3,null,4,null,"pobede","porazi","mesto",null,"plasman grupe 8"]
[1,{"v":81,"d":"8-1"},{"$f":"IF(ISNA(MATCH(B103,spisak!$F$4:$F$308,0)),\"\",INDEX(spisak!$C$4:$C$308,MATCH(B103,spisak!$F$4:$F$308,0)))","v":"Stak Zemun"},{"$f":"IF(ISNA(MATCH(B103,spisak!$F$4:$F$308,0)),\"bye\",INDEX(spisak!$B$4:$B$308,MATCH(B103,spisak!$F$4:$F$308,0)))","v":"Bošković Marko"},null,null,{"$f":"INDEX(E108:E113,MATCH(D103&D104,C108:C113&D108:D113,0))&\"/\"&INDEX(F108:F113,MATCH(D103&D104,C108:C113&D108:D113,0))","v":"3/1"},null,{"$f":"INDEX(E108:E113,MATCH(D103&D105,C108:C113&D108:D113,0))&\"/\"&INDEX(F108:F113,MATCH(D103&D105,C108:C113&D108:D113,0))","v":"3/0"},null,{"$f":"INDEX(E108:E113,MATCH(D103&D106,C108:C113&D108:D113,0))&\"/\"&INDEX(F108:F113,MATCH(D103&D106,C108:C113&D108:D113,0))","v":"/"},null,{"$f":"IF(ISBLANK(partije!$J$2),\"\",COUNTIFS(C108:C113,D103,E108:E113,3)+COUNTIFS(D108:D113,D103,F108:F113,3))","v":2},{"$f":"IF(ISBLANK(partije!$J$2),\"\",COUNTIFS(C108:C113,D103,E108:E113,\"<3\")+COUNTIFS(D108:D113,D103,F108:F113,\"<3\"))","v":0},1,1,{"$f":"IF(ISBLANK(D103),\"*\",INDEX(D103:D106,MATCH(P103,O103:O106,0)))","v":"Bošković Marko"}]
[2,{"v":82,"d":"8-2"},{"$f":"IF(ISNA(MATCH(B104,spisak!$F$4:$F$308,0)),\"\",INDEX(spisak!$C$4:$C$308,MATCH(B104,spisak!$F$4:$F$308,0)))","v":"Prva Petoletka"},{"$f":"IF(ISNA(MATCH(B104,spisak!$F$4:$F$308,0)),\"bye\",INDEX(spisak!$B$4:$B$308,MATCH(B104,spisak!$F$4:$F$308,0)))","v":"Mladenović Ognjen"},{"$f":"INDEX(F108:F113,MATCH(D103&D104,C108:C113&D108:D113,0))&\"/\"&INDEX(E108:E113,MATCH(D103&D104,C108:C113&D108:D113,0))","v":"1/3"},{"$nulls":3},{"$f":"INDEX(E108:E113,MATCH(D104&D105,C108:C113&D108:D113,0))&\"/\"&INDEX(F108:F113,MATCH(D104&D105,C108:C113&D108:D113,0))","v":"3/0"},null,{"$f":"INDEX(E108:E113,MATCH(D104&D106,C108:C113&D108:D113,0))&\"/\"&INDEX(F108:F113,MATCH(D104&D106,C108:C113&D108:D113,0))","v":"/"},null,{"$f":"IF(ISBLANK(partije!$J$2),\"\",COUNTIFS(C108:C113,D104,E108:E113,3)+COUNTIFS(D108:D113,D104,F108:F113,3))","v":1},{"$f":"IF(ISBLANK(partije!$J$2),\"\",COUNTIFS(C108:C113,D104,E108:E113,\"<3\")+COUNTIFS(D108:D113,D104,F108:F113,\"<3\"))","v":1},2,2,{"$f":"IF(ISBLANK(D104),\"*\",INDEX(D103:D106,MATCH(P104,O103:O106,0)))","v":"Mladenović Ognjen"}]
[3,{"v":83,"d":"8-3"},{"$f":"IF(ISNA(MATCH(B105,spisak!$F$4:$F$308,0)),\"\",INDEX(spisak!$C$4:$C$308,MATCH(B105,spisak!$F$4:$F$308,0)))","v":"Skoplje"},{"$f":"IF(ISNA(MATCH(B105,spisak!$F$4:$F$308,0)),\"bye\",INDEX(spisak!$B$4:$B$308,MATCH(B105,spisak!$F$4:$F$308,0)))","v":"Titovski Nenad"},{"$f":"INDEX(F108:F113,MATCH(D103&D105,C108:C113&D108:D113,0))&\"/\"&INDEX(E108:E113,MATCH(D103&D105,C108:C113&D108:D113,0))","v":"0/3"},null,{"$f":"INDEX(F108:F113,MATCH(D104&D105,C108:C113&D108:D113,0))&\"/\"&INDEX(E108:E113,MATCH(D104&D105,C108:C113&D108:D113,0))","v":"0/3"},{"$nulls":3},{"$f":"INDEX(E108:E113,MATCH(D105&D106,C108:C113&D108:D113,0))&\"/\"&INDEX(F108:F113,MATCH(D105&D106,C108:C113&D108:D113,0))","v":"/"},null,{"$f":"IF(ISBLANK(partije!$J$2),\"\",COUNTIFS(C108:C113,D105,E108:E113,3)+COUNTIFS(D108:D113,D105,F108:F113,3))","v":0},{"$f":"IF(ISBLANK(partije!$J$2),\"\",COUNTIFS(C108:C113,D105,E108:E113,\"<3\")+COUNTIFS(D108:D113,D105,F108:F113,\"<3\"))","v":2},3,3,{"$f":"IF(ISBLANK(D105),\"*\",INDEX(D103:D106,MATCH(P105,O103:O106,0)))","v":"Titovski Nenad"}]
[4,{"v":84,"d":"8-4"},{"$f":"IF(ISNA(MATCH(B106,spisak!$F$4:$F$308,0)),\"\",INDEX(spisak!$C$4:$C$308,MATCH(B106,spisak!$F$4:$F$308,0)))","v":""},{"$f":"IF(ISNA(MATCH(B106,spisak!$F$4:$F$308,0)),\"bye\",INDEX(spisak!$B$4:$B$308,MATCH(B106,spisak!$F$4:$F$308,0)))","v":"bye"},{"$f":"INDEX(F108:F113,MATCH(D103&D106,C108:C113&D108:D113,0))&\"/\"&INDEX(E108:E113,MATCH(D103&D106,C108:C113&D108:D113,0))","v":"/"},null,{"$f":"INDEX(F108:F113,MATCH(D104&D106,C108:C113&D108:D113,0))&\"/\"&INDEX(E108:E113,MATCH(D104&D106,C108:C113&D108:D113,0))","v":"/"},null,{"$f":"INDEX(F108:F113,MATCH(D105&D106,C108:C113&D108:D113,0))&\"/\"&INDEX(E108:E113,MATCH(D105&D106,C108:C113&D108:D113,0))","v":"/"},{"$nulls":3},{"$f":"IF(ISBLANK(partije!$J$2),\"\",COUNTIFS(C108:C113,D106,E108:E113,3)+COUNTIFS(D108:D113,D106,F108:F113,3))","v":0},{"$f":"IF(ISBLANK(partije!$J$2),\"\",COUNTIFS(C108:C113,D106,E108:E113,\"<3\")+COUNTIFS(D108:D113,D106,F108:F113,\"<3\"))","v":0},null,4,{"$f":"IF(ISBLANK(D106),\"*\",INDEX(D103:D106,MATCH(P106,O103:O106,0)))","v":{"$error":"#N/A"}}]
[{"$nulls":4},"rezultat",null,"set1",null,"set 2",null,"set 3",null,"set 4","set 5","set 6","set 7",null,null,"berger4"]
[{"$f":"IF(ISBLANK(partije!D16),\"\",partije!D16)","v":""},{"$f":"IF(ISBLANK(partije!E16),\"\",partije!E16)","v":""},{"$f":"INDEX(D103:D106,MATCH(S108,A103:A106,0))","v":"Bošković Marko"},{"$f":"INDEX(D103:D106,MATCH(T108,A103:A106,0))","v":"Titovski Nenad"},{"$f":"IF(ISBLANK(partije!J16),\"\",partije!J16)","v":3},{"$f":"IF(ISBLANK(partije!K16),\"\",partije!K16)","v":0},{"$f":"IF(ISBLANK(partije!L16),\"\",partije!L16)","v":{"v":1106,"d":"11-06"}},null,{"$f":"IF(ISBLANK(partije!M16),\"\",partije!M16)","v":{"v":1105,"d":"11-05"}},null,{"$f":"IF(ISBLANK(partije!N16),\"\",partije!N16)","v":{"v":1101,"d":"11-01"}},{"$f":"IF(ISBLANK(partije!M16),\"\",partije!M16)","v":{"v":1105,"d":"11-05"}},{"$f":"IF(ISBLANK(partije!O16),\"\",partije!O16)","v":""},{"$f":"IF(ISBLANK(partije!P16),\"\",partije!P16)","v":""},{"$f":"IF(ISBLANK(partije!Q16),\"\",partije!Q16)","v":""},{"$f":"IF(ISBLANK(partije!R16),\"\",partije!R16)","v":""},{"$f":"IF(ISBLANK(partije!$D$16),\"\",partije!$D$16)","v":""},{"$f":"IF(ISBLANK(partije!$E$16),\"\",\"sto \"&partije!$E$16)","v":""},{"$f":"$S$10","v":1},{"$f":"$T$10","v":3}]
[{"$f":"IF(ISBLANK(partije!D17),\"\",partije!D17)","v":""},{"$f":"IF(ISBLANK(partije!E17),\"\",partije!E17)","v":""},{"$f":"INDEX(D103:D106,MATCH(S109,A103:A106,0))","v":"Mladenović Ognjen"},{"$f":"INDEX(D103:D106,MATCH(T109,A103:A106,0))","v":"bye"},{"$f":"IF(ISBLANK(partije!J17),\"\",partije!J17)","v":""},{"$f":"IF(ISBLANK(partije!K17),\"\",partije!K17)","v":""},{"$f":"IF(ISBLANK(partije!L17),\"\",partije!L17)","v":""},null,{"$f":"IF(ISBLANK(partije!M17),\"\",partije!M17)","v":""},null,{"$f":"IF(ISBLANK(partije!N17),\"\",partije!N17)","v":""},{"$f":"IF(ISBLANK(partije!M17),\"\",partije!M17)","v":""},{"$f":"IF(ISBLANK(partije!O17),\"\",partije!O17)","v":""},{"$f":"IF(ISBLANK(partije!P17),\"\",partije!P17)","v":""},{"$f":"IF(ISBLANK(partije!Q17),\"\",partije!Q17)","v":""},{"$f":"IF(ISBLANK(partije!R17),\"\",partije!R17)","v":""},{"$f":"IF(ISBLANK(partije!$D$17),\"\",partije!$D$17)","v":""},{"$f":"IF(ISBLANK(partije!$E$17),\"\",\"sto \"&partije!$E$17)","v":""},{"$f":"$S$11","v":2},{"$f":"$T$11","v":4}]
[{"$f":"IF(ISBLANK(partije!D82),\"\",partije!D82)","v":""},{"$f":"IF(ISBLANK(partije!E82),\"\",partije!E82)","v":""},{"$f":"INDEX(D103:D106,MATCH(S110,A103:A106,0))","v":"Bošković Marko"},{"$f":"INDEX(D103:D106,MATCH(T110,A103:A106,0))","v":"Mladenović Ognjen"},{"$f":"IF(ISBLANK(partije!J82),\"\",partije!J82)","v":3},{"$f":"IF(ISBLANK(partije!K82),\"\",partije!K82)","v":1},{"$f":"IF(ISBLANK(partije!L82),\"\",partije!L82)","v":{"v":1108,"d":"11-08"}},null,{"$f":"IF(ISBLANK(partije!M82),\"\",partije!M82)","v":{"v":1102,"d":"11-02"}},null,{"$f":"IF(ISBLANK(partije!N82),\"\",partije!N82)","v":{"v":711,"d":"07-11"}},{"$f":"IF(ISBLANK(partije!M82),\"\",partije!M82)","v":{"v":1102,"d":"11-02"}},{"$f":"IF(ISBLANK(partije!O82),\"\",partije!O82)","v":{"v":1105,"d":"11-05"}},{"$f":"IF(ISBLANK(partije!P82),\"\",partije!P82)","v":""},{"$f":"IF(ISBLANK(partije!Q82),\"\",partije!Q82)","v":""},{"$f":"IF(ISBLANK(partije!R82),\"\",partije!R82)","v":""},{"$f":"IF(ISBLANK(partije!$D$82),\"\",partije!$D$82)","v":""},{"$f":"IF(ISBLANK(partije!$E$82),\"\",\"sto \"&partije!$E$82)","v":""},{"$f":"$S$12","v":1},{"$f":"$T$12","v":2}]
[{"$f":"IF(ISBLANK(partije!D83),\"\",partije!D83)","v":""},{"$f":"IF(ISBLANK(partije!E83),\"\",partije!E83)","v":""},{"$f":"INDEX(D103:D106,MATCH(S111,A103:A106,0))","v":"Titovski Nenad"},{"$f":"INDEX(D103:D106,MATCH(T111,A103:A106,0))","v":"bye"},{"$f":"IF(ISBLANK(partije!J83),\"\",partije!J83)","v":""},{"$f":"IF(ISBLANK(partije!K83),\"\",partije!K83)","v":""},{"$f":"IF(ISBLANK(partije!L83),\"\",partije!L83)","v":""},null,{"$f":"IF(ISBLANK(partije!M83),\"\",partije!M83)","v":""},null,{"$f":"IF(ISBLANK(partije!N83),\"\",partije!N83)","v":""},{"$f":"IF(ISBLANK(partije!M83),\"\",partije!M83)","v":""},{"$f":"IF(ISBLANK(partije!O83),\"\",partije!O83)","v":""},{"$f":"IF(ISBLANK(partije!P83),\"\",partije!P83)","v":""},{"$f":"IF(ISBLANK(partije!Q83),\"\",partije!Q83)","v":""},{"$f":"IF(ISBLANK(partije!R83),\"\",partije!R83)","v":""},{"$f":"IF(ISBLANK(partije!$D$83),\"\",partije!$D$83)","v":""},{"$f":"IF(ISBLANK(partije!$E$83),\"\",\"sto \"&partije!$E$83)","v":""},{"$f":"$S$13","v":3},{"$f":"$T$13","v":4}]
[{"$f":"IF(ISBLANK(partije!D148),\"\",partije!D148)","v":""},{"$f":"IF(ISBLANK(partije!E148),\"\",partije!E148)","v":""},{"$f":"INDEX(D103:D106,MATCH(S112,A103:A106,0))","v":"Bošković Marko"},{"$f":"INDEX(D103:D106,MATCH(T112,A103:A106,0))","v":"bye"},{"$f":"IF(ISBLANK(partije!J148),\"\",partije!J148)","v":""},{"$f":"IF(ISBLANK(partije!K148),\"\",partije!K148)","v":""},{"$f":"IF(ISBLANK(partije!L148),\"\",partije!L148)","v":""},null,{"$f":"IF(ISBLANK(partije!M148),\"\",partije!M148)","v":""},null,{"$f":"IF(ISBLANK(partije!N148),\"\",partije!N148)","v":""},{"$f":"IF(ISBLANK(partije!M148),\"\",partije!M148)","v":""},{"$f":"IF(ISBLANK(partije!O148),\"\",partije!O148)","v":""},{"$f":"IF(ISBLANK(partije!P148),\"\",partije!P148)","v":""},{"$f":"IF(ISBLANK(partije!Q148),\"\",partije!Q148)","v":""},{"$f":"IF(ISBLANK(partije!R148),\"\",partije!R148)","v":""},{"$f":"IF(ISBLANK(partije!$D$148),\"\",partije!$D$148)","v":""},{"$f":"IF(ISBLANK(partije!$E$148),\"\",\"sto \"&partije!$E$148)","v":""},{"$f":"$S$14","v":1},{"$f":"$T$14","v":4}]
[{"$f":"IF(ISBLANK(partije!D149),\"\",partije!D149)","v":""},{"$f":"IF(ISBLANK(partije!E149),\"\",partije!E149)","v":""},{"$f":"INDEX(D103:D106,MATCH(S113,A103:A106,0))","v":"Mladenović Ognjen"},{"$f":"INDEX(D103:D106,MATCH(T113,A103:A106,0))","v":"Titovski Nenad"},{"$f":"IF(ISBLANK(partije!J149),\"\",partije!J149)","v":3},{"$f":"IF(ISBLANK(partije!K149),\"\",partije!K149)","v":0},{"$f":"IF(ISBLANK(partije!L149),\"\",partije!L149)","v":{"v":1105,"d":"11-05"}},null,{"$f":"IF(ISBLANK(partije!M149),\"\",partije!M149)","v":{"v":1108,"d":"11-08"}},null,{"$f":"IF(ISBLANK(partije!N149),\"\",partije!N149)","v":{"v":1109,"d":"11-09"}},{"$f":"IF(ISBLANK(partije!M149),\"\",partije!M149)","v":{"v":1108,"d":"11-08"}},{"$f":"IF(ISBLANK(partije!O149),\"\",partije!O149)","v":""},{"$f":"IF(ISBLANK(partije!P149),\"\",partije!P149)","v":""},{"$f":"IF(ISBLANK(partije!Q149),\"\",partije!Q149)","v":""},{"$f":"IF(ISBLANK(partije!R149),\"\",partije!R149)","v":""},{"$f":"IF(ISBLANK(partije!$D$149),\"\",partije!$D$149)","v":""},{"$f":"IF(ISBLANK(partije!$E$147),\"\",\"sto \"&partije!$E$147)","v":""},{"$f":"$S$15","v":2},{"$f":"$T$15","v":3}]
[]
[{"$nulls":3},"grupa 9"]
[null,"br.",null,"igrač",1,null,2,null,3,null,4,null,"pobede","porazi","mesto",null,"plasman grupe 9"]
[1,{"v":91,"d":"9-1"},{"$f":"IF(ISNA(MATCH(B117,spisak!$F$4:$F$308,0)),\"\",INDEX(spisak!$C$4:$C$308,MATCH(B117,spisak!$F$4:$F$308,0)))","v":"Stak Zemun"},{"$f":"IF(ISNA(MATCH(B117,spisak!$F$4:$F$308,0)),\"bye\",INDEX(spisak!$B$4:$B$308,MATCH(B117,spisak!$F$4:$F$308,0)))","v":"Ninković Uroš"},null,null,{"$f":"INDEX(E122:E127,MATCH(D117&D118,C122:C127&D122:D127,0))&\"/\"&INDEX(F122:F127,MATCH(D117&D118,C122:C127&D122:D127,0))","v":"3/0"},null,{"$f":"INDEX(E122:E127,MATCH(D117&D119,C122:C127&D122:D127,0))&\"/\"&INDEX(F122:F127,MATCH(D117&D119,C122:C127&D122:D127,0))","v":"3/0"},null,{"$f":"INDEX(E122:E127,MATCH(D117&D120,C122:C127&D122:D127,0))&\"/\"&INDEX(F122:F127,MATCH(D117&D120,C122:C127&D122:D127,0))","v":"/"},null,{"$f":"IF(ISBLANK(partije!$J$2),\"\",COUNTIFS(C122:C127,D117,E122:E127,3)+COUNTIFS(D122:D127,D117,F122:F127,3))","v":2},{"$f":"IF(ISBLANK(partije!$J$2),\"\",COUNTIFS(C122:C127,D117,E122:E127,\"<3\")+COUNTIFS(D122:D127,D117,F122:F127,\"<3\"))","v":0},1,1,{"$f":"IF(ISBLANK(D117),\"*\",INDEX(D117:D120,MATCH(P117,O117:O120,0)))","v":"Ninković Uroš"}]
[2,{"v":92,"d":"9-2"},{"$f":"IF(ISNA(MATCH(B118,spisak!$F$4:$F$308,0)),\"\",INDEX(spisak!$C$4:$C$308,MATCH(B118,spisak!$F$4:$F$308,0)))","v":"Sinđelić Beograd"},{"$f":"IF(ISNA(MATCH(B118,spisak!$F$4:$F$308,0)),\"bye\",INDEX(spisak!$B$4:$B$308,MATCH(B118,spisak!$F$4:$F$308,0)))","v":"Jovanović Đurađ"},{"$f":"INDEX(F122:F127,MATCH(D117&D118,C122:C127&D122:D127,0))&\"/\"&INDEX(E122:E127,MATCH(D117&D118,C122:C127&D122:D127,0))","v":"0/3"},{"$nulls":3},{"$f":"INDEX(E122:E127,MATCH(D118&D119,C122:C127&D122:D127,0))&\"/\"&INDEX(F122:F127,MATCH(D118&D119,C122:C127&D122:D127,0))","v":"3/0"},null,{"$f":"INDEX(E122:E127,MATCH(D118&D120,C122:C127&D122:D127,0))&\"/\"&INDEX(F122:F127,MATCH(D118&D120,C122:C127&D122:D127,0))","v":"/"},null,{"$f":"IF(ISBLANK(partije!$J$2),\"\",COUNTIFS(C122:C127,D118,E122:E127,3)+COUNTIFS(D122:D127,D118,F122:F127,3))","v":1},{"$f":"IF(ISBLANK(partije!$J$2),\"\",COUNTIFS(C122:C127,D118,E122:E127,\"<3\")+COUNTIFS(D122:D127,D118,F122:F127,\"<3\"))","v":1},2,2,{"$f":"IF(ISBLANK(D118),\"*\",INDEX(D117:D120,MATCH(P118,O117:O120,0)))","v":"Jovanović Đurađ"}]
[3,{"v":93,"d":"9-3"},{"$f":"IF(ISNA(MATCH(B119,spisak!$F$4:$F$308,0)),\"\",INDEX(spisak!$C$4:$C$308,MATCH(B119,spisak!$F$4:$F$308,0)))","v":"Lala"},{"$f":"IF(ISNA(MATCH(B119,spisak!$F$4:$F$308,0)),\"bye\",INDEX(spisak!$B$4:$B$308,MATCH(B119,spisak!$F$4:$F$308,0)))","v":"Lazić Nemanja"},{"$f":"INDEX(F122:F127,MATCH(D117&D119,C122:C127&D122:D127,0))&\"/\"&INDEX(E122:E127,MATCH(D117&D119,C122:C127&D122:D127,0))","v":"0/3"},null,{"$f":"INDEX(F122:F127,MATCH(D118&D119,C122:C127&D122:D127,0))&\"/\"&INDEX(E122:E127,MATCH(D118&D119,C122:C127&D122:D127,0))","v":"0/3"},{"$nulls":3},{"$f":"INDEX(E122:E127,MATCH(D119&D120,C122:C127&D122:D127,0))&\"/\"&INDEX(F122:F127,MATCH(D119&D120,C122:C127&D122:D127,0))","v":"/"},null,{"$f":"IF(ISBLANK(partije!$J$2),\"\",COUNTIFS(C122:C127,D119,E122:E127,3)+COUNTIFS(D122:D127,D119,F122:F127,3))","v":0},{"$f":"IF(ISBLANK(partije!$J$2),\"\",COUNTIFS(C122:C127,D119,E122:E127,\"<3\")+COUNTIFS(D122:D127,D119,F122:F127,\"<3\"))","v":2},3,3,{"$f":"IF(ISBLANK(D119),\"*\",INDEX(D117:D120,MATCH(P119,O117:O120,0)))","v":"Lazić Nemanja"}]
[4,{"v":94,"d":"9-4"},{"$f":"IF(ISNA(MATCH(B120,spisak!$F$4:$F$308,0)),\"\",INDEX(spisak!$C$4:$C$308,MATCH(B120,spisak!$F$4:$F$308,0)))","v":""},{"$f":"IF(ISNA(MATCH(B120,spisak!$F$4:$F$308,0)),\"bye\",INDEX(spisak!$B$4:$B$308,MATCH(B120,spisak!$F$4:$F$308,0)))","v":"bye"},{"$f":"INDEX(F122:F127,MATCH(D117&D120,C122:C127&D122:D127,0))&\"/\"&INDEX(E122:E127,MATCH(D117&D120,C122:C127&D122:D127,0))","v":"/"},null,{"$f":"INDEX(F122:F127,MATCH(D118&D120,C122:C127&D122:D127,0))&\"/\"&INDEX(E122:E127,MATCH(D118&D120,C122:C127&D122:D127,0))","v":"/"},null,{"$f":"INDEX(F122:F127,MATCH(D119&D120,C122:C127&D122:D127,0))&\"/\"&INDEX(E122:E127,MATCH(D119&D120,C122:C127&D122:D127,0))","v":"/"},{"$nulls":3},{"$f":"IF(ISBLANK(partije!$J$2),\"\",COUNTIFS(C122:C127,D120,E122:E127,3)+COUNTIFS(D122:D127,D120,F122:F127,3))","v":0},{"$f":"IF(ISBLANK(partije!$J$2),\"\",COUNTIFS(C122:C127,D120,E122:E127,\"<3\")+COUNTIFS(D122:D127,D120,F122:F127,\"<3\"))","v":0},null,4,{"$f":"IF(ISBLANK(D120),\"*\",INDEX(D117:D120,MATCH(P120,O117:O120,0)))","v":{"$error":"#N/A"}}]
[{"$nulls":4},"rezultat",null,"set1",null,"set 2",null,"set 3",null,"set 4","set 5","set 6","set 7",null,null,"berger4"]
[{"$f":"IF(ISBLANK(partije!D18),\"\",partije!D18)","v":""},{"$f":"IF(ISBLANK(partije!E18),\"\",partije!E18)","v":""},{"$f":"INDEX(D117:D120,MATCH(S122,A117:A120,0))","v":"Ninković Uroš"},{"$f":"INDEX(D117:D120,MATCH(T122,A117:A120,0))","v":"Lazić Nemanja"},{"$f":"IF(ISBLANK(partije!J18),\"\",partije!J18)","v":3},{"$f":"IF(ISBLANK(partije!K18),\"\",partije!K18)","v":0},{"$f":"IF(ISBLANK(partije!L18),\"\",partije!L18)","v":{"v":1105,"d":"11-05"}},null,{"$f":"IF(ISBLANK(partije!M18),\"\",partije!M18)","v":{"v":1104,"d":"11-04"}},null,{"$f":"IF(ISBLANK(partije!N18),\"\",partije!N18)","v":{"v":1105,"d":"11-05"}},{"$f":"IF(ISBLANK(partije!M18),\"\",partije!M18)","v":{"v":1104,"d":"11-04"}},{"$f":"IF(ISBLANK(partije!O18),\"\",partije!O18)","v":""},{"$f":"IF(ISBLANK(partije!P18),\"\",partije!P18)","v":""},{"$f":"IF(ISBLANK(partije!Q18),\"\",partije!Q18)","v":""},{"$f":"IF(ISBLANK(partije!R18),\"\",partije!R18)","v":""},{"$f":"IF(ISBLANK(partije!$D$18),\"\",partije!$D$18)","v":""},{"$f":"IF(ISBLANK(partije!$E$18),\"\",\"sto \"&partije!$E$18)","v":""},{"$f":"$S$10","v":1},{"$f":"$T$10","v":3}]
[{"$f":"IF(ISBLANK(partije!D19),\"\",partije!D19)","v":""},{"$f":"IF(ISBLANK(partije!E19),\"\",partije!E19)","v":""},{"$f":"INDEX(D117:D120,MATCH(S123,A117:A120,0))","v":"Jovanović Đurađ"},{"$f":"INDEX(D117:D120,MATCH(T123,A117:A120,0))","v":"bye"},{"$f":"IF(ISBLANK(partije!J19),\"\",partije!J19)","v":""},{"$f":"IF(ISBLANK(partije!K19),\"\",partije!K19)","v":""},{"$f":"IF(ISBLANK(partije!L19),\"\",partije!L19)","v":""},null,{"$f":"IF(ISBLANK(partije!M19),\"\",partije!M19)","v":""},null,{"$f":"IF(ISBLANK(partije!N19),\"\",partije!N19)","v":""},{"$f":"IF(ISBLANK(partije!M19),\"\",partije!M19)","v":""},{"$f":"IF(ISBLANK(partije!O19),\"\",partije!O19)","v":""},{"$f":"IF(ISBLANK(partije!P19),\"\",partije!P19)","v":""},{"$f":"IF(ISBLANK(partije!Q19),\"\",partije!Q19)","v":""},{"$f":"IF(ISBLANK(partije!R19),\"\",partije!R19)","v":""},{"$f":"IF(ISBLANK(partije!$D$19),\"\",partije!$D$19)","v":""},{"$f":"IF(ISBLANK(partije!$E$19),\"\",\"sto \"&partije!$E$19)","v":""},{"$f":"$S$11","v":2},{"$f":"$T$11","v":4}]
[{"$f":"IF(ISBLANK(partije!D84),\"\",partije!D84)","v":""},{"$f":"IF(ISBLANK(partije!E84),\"\",partije!E84)","v":""},{"$f":"INDEX(D117:D120,MATCH(S124,A117:A120,0))","v":"Ninković Uroš"},{"$f":"INDEX(D117:D120,MATCH(T124,A117:A120,0))","v":"Jovanović Đurađ"},{"$f":"IF(ISBLANK(partije!J84),\"\",partije!J84)","v":3},{"$f":"IF(ISBLANK(partije!K84),\"\",partije!K84)","v":0},{"$f":"IF(ISBLANK(partije!L84),\"\",partije!L84)","v":{"v":1109,"d":"11-09"}},null,{"$f":"IF(ISBLANK(partije!M84),\"\",partije!M84)","v":{"v":1104,"d":"11-04"}},null,{"$f":"IF(ISBLANK(partije!N84),\"\",partije!N84)","v":{"v":1107,"d":"11-07"}},{"$f":"IF(ISBLANK(partije!M84),\"\",partije!M84)","v":{"v":1104,"d":"11-04"}},{"$f":"IF(ISBLANK(partije!O84),\"\",partije!O84)","v":""},{"$f":"IF(ISBLANK(partije!P84),\"\",partije!P84)","v":""},{"$f":"IF(ISBLANK(partije!Q84),\"\",partije!Q84)","v":""},{"$f":"IF(ISBLANK(partije!R84),\"\",partije!R84)","v":""},{"$f":"IF(ISBLANK(partije!$D$84),\"\",partije!$D$84)","v":""},{"$f":"IF(ISBLANK(partije!$E$84),\"\",\"sto \"&partije!$E$84)","v":""},{"$f":"$S$12","v":1},{"$f":"$T$12","v":2}]
[{"$f":"IF(ISBLANK(partije!D85),\"\",partije!D85)","v":""},{"$f":"IF(ISBLANK(partije!E85),\"\",partije!E85)","v":""},{"$f":"INDEX(D117:D120,MATCH(S125,A117:A120,0))","v":"Lazić Nemanja"},{"$f":"INDEX(D117:D120,MATCH(T125,A117:A120,0))","v":"bye"},{"$f":"IF(ISBLANK(partije!J85),\"\",partije!J85)","v":""},{"$f":"IF(ISBLANK(partije!K85),\"\",partije!K85)","v":""},{"$f":"IF(ISBLANK(partije!L85),\"\",partije!L85)","v":""},null,{"$f":"IF(ISBLANK(partije!M85),\"\",partije!M85)","v":""},null,{"$f":"IF(ISBLANK(partije!N85),\"\",partije!N85)","v":""},{"$f":"IF(ISBLANK(partije!M85),\"\",partije!M85)","v":""},{"$f":"IF(ISBLANK(partije!O85),\"\",partije!O85)","v":""},{"$f":"IF(ISBLANK(partije!P85),\"\",partije!P85)","v":""},{"$f":"IF(ISBLANK(partije!Q85),\"\",partije!Q85)","v":""},{"$f":"IF(ISBLANK(partije!R85),\"\",partije!R85)","v":""},{"$f":"IF(ISBLANK(partije!$D$85),\"\",partije!$D$85)","v":""},{"$f":"IF(ISBLANK(partije!$E$85),\"\",\"sto \"&partije!$E$85)","v":""},{"$f":"$S$13","v":3},{"$f":"$T$13","v":4}]
[{"$f":"IF(ISBLANK(partije!D150),\"\",partije!D150)","v":""},{"$f":"IF(ISBLANK(partije!E150),\"\",partije!E150)","v":""},{"$f":"INDEX(D117:D120,MATCH(S126,A117:A120,0))","v":"Ninković Uroš"},{"$f":"INDEX(D117:D120,MATCH(T126,A117:A120,0))","v":"bye"},{"$f":"IF(ISBLANK(partije!J150),\"\",partije!J150)","v":""},{"$f":"IF(ISBLANK(partije!K150),\"\",partije!K150)","v":""},{"$f":"IF(ISBLANK(partije!L150),\"\",partije!L150)","v":""},null,{"$f":"IF(ISBLANK(partije!M150),\"\",partije!M150)","v":""},null,{"$f":"IF(ISBLANK(partije!N150),\"\",partije!N150)","v":""},{"$f":"IF(ISBLANK(partije!M150),\"\",partije!M150)","v":""},{"$f":"IF(ISBLANK(partije!O150),\"\",partije!O150)","v":""},{"$f":"IF(ISBLANK(partije!P150),\"\",partije!P150)","v":""},{"$f":"IF(ISBLANK(partije!Q150),\"\",partije!Q150)","v":""},{"$f":"IF(ISBLANK(partije!R150),\"\",partije!R150)","v":""},{"$f":"IF(ISBLANK(partije!$D$150),\"\",partije!$D$150)","v":""},{"$f":"IF(ISBLANK(partije!$E$150),\"\",\"sto \"&partije!$E$150)","v":""},{"$f":"$S$14","v":1},{"$f":"$T$14","v":4}]
[{"$f":"IF(ISBLANK(partije!D151),\"\",partije!D151)","v":""},{"$f":"IF(ISBLANK(partije!E151),\"\",partije!E151)","v":""},{"$f":"INDEX(D117:D120,MATCH(S127,A117:A120,0))","v":"Jovanović Đurađ"},{"$f":"INDEX(D117:D120,MATCH(T127,A117:A120,0))","v":"Lazić Nemanja"},{"$f":"IF(ISBLANK(partije!J151),\"\",partije!J151)","v":3},{"$f":"IF(ISBLANK(partije!K151),\"\",partije!K151)","v":0},{"$f":"IF(ISBLANK(partije!L151),\"\",partije!L151)","v":{"v":1105,"d":"11-05"}},null,{"$f":"IF(ISBLANK(partije!M151),\"\",partije!M151)","v":{"v":1107,"d":"11-07"}},null,{"$f":"IF(ISBLANK(partije!N151),\"\",partije!N151)","v":{"v":1102,"d":"11-02"}},{"$f":"IF(ISBLANK(partije!M151),\"\",partije!M151)","v":{"v":1107,"d":"11-07"}},{"$f":"IF(ISBLANK(partije!O151),\"\",partije!O151)","v":""},{"$f":"IF(ISBLANK(partije!P151),\"\",partije!P151)","v":""},{"$f":"IF(ISBLANK(partije!Q151),\"\",partije!Q151)","v":""},{"$f":"IF(ISBLANK(partije!R151),\"\",partije!R151)","v":""},{"$f":"IF(ISBLANK(partije!$D$151),\"\",partije!$D$151)","v":""},{"$f":"IF(ISBLANK(partije!$E$2),\"\",\"sto \"&partije!$E$2)","v":""},{"$f":"$S$15","v":2},{"$f":"$T$15","v":3}]
[]
[{"$nulls":3},"grupa 10"]
[null,"br.",null,"igrač",1,null,2,null,3,null,4,null,"pobede","porazi","mesto",null,"plasman grupe 10"]
[1,{"v":101,"d":"10-1"},{"$f":"IF(ISNA(MATCH(B131,spisak!$F$4:$F$308,0)),\"\",INDEX(spisak!$C$4:$C$308,MATCH(B131,spisak!$F$4:$F$308,0)))","v":"Novi Sad"},{"$f":"IF(ISNA(MATCH(B131,spisak!$F$4:$F$308,0)),\"bye\",INDEX(spisak!$B$4:$B$308,MATCH(B131,spisak!$F$4:$F$308,0)))","v":"Rajić Borislav"},null,null,{"$f":"INDEX(E136:E141,MATCH(D131&D132,C136:C141&D136:D141,0))&\"/\"&INDEX(F136:F141,MATCH(D131&D132,C136:C141&D136:D141,0))","v":"3/1"},null,{"$f":"INDEX(E136:E141,MATCH(D131&D133,C136:C141&D136:D141,0))&\"/\"&INDEX(F136:F141,MATCH(D131&D133,C136:C141&D136:D141,0))","v":"3/0"},null,{"$f":"INDEX(E136:E141,MATCH(D131&D134,C136:C141&D136:D141,0))&\"/\"&INDEX(F136:F141,MATCH(D131&D134,C136:C141&D136:D141,0))","v":"/"},null,{"$f":"IF(ISBLANK(partije!$J$2),\"\",COUNTIFS(C136:C141,D131,E136:E141,3)+COUNTIFS(D136:D141,D131,F136:F141,3))","v":2},{"$f":"IF(ISBLANK(partije!$J$2),\"\",COUNTIFS(C136:C141,D131,E136:E141,\"<3\")+COUNTIFS(D136:D141,D131,F136:F141,\"<3\"))","v":0},1,1,{"$f":"IF(ISBLANK(D131),\"*\",INDEX(D131:D134,MATCH(P131,O131:O134,0)))","v":"Rajić Borislav"}]
[2,{"v":102,"d":"10-2"},{"$f":"IF(ISNA(MATCH(B132,spisak!$F$4:$F$308,0)),\"\",INDEX(spisak!$C$4:$C$308,MATCH(B132,spisak!$F$4:$F$308,0)))","v":"Vršac"},{"$f":"IF(ISNA(MATCH(B132,spisak!$F$4:$F$308,0)),\"bye\",INDEX(spisak!$B$4:$B$308,MATCH(B132,spisak!$F$4:$F$308,0)))","v":"Konstantinov Marko"},{"$f":"INDEX(F136:F141,MATCH(D131&D132,C136:C141&D136:D141,0))&\"/\"&INDEX(E136:E141,MATCH(D131&D132,C136:C141&D136:D141,0))","v":"1/3"},{"$nulls":3},{"$f":"INDEX(E136:E141,MATCH(D132&D133,C136:C141&D136:D141,0))&\"/\"&INDEX(F136:F141,MATCH(D132&D133,C136:C141&D136:D141,0))","v":"3/0"},null,{"$f":"INDEX(E136:E141,MATCH(D132&D134,C136:C141&D136:D141,0))&\"/\"&INDEX(F136:F141,MATCH(D132&D134,C136:C141&D136:D141,0))","v":"/"},null,{"$f":"IF(ISBLANK(partije!$J$2),\"\",COUNTIFS(C136:C141,D132,E136:E141,3)+COUNTIFS(D136:D141,D132,F136:F141,3))","v":1},{"$f":"IF(ISBLANK(partije!$J$2),\"\",COUNTIFS(C136:C141,D132,E136:E141,\"<3\")+COUNTIFS(D136:D141,D132,F136:F141,\"<3\"))","v":1},2,2,{"$f":"IF(ISBLANK(D132),\"*\",INDEX(D131:D134,MATCH(P132,O131:O134,0)))","v":"Konstantinov Marko"}]
[3,{"v":103,"d":"10-3"},{"$f":"IF(ISNA(MATCH(B133,spisak!$F$4:$F$308,0)),\"\",INDEX(spisak!$C$4:$C$308,MATCH(B133,spisak!$F$4:$F$308,0)))","v":"Bdinci Bugarska"},{"$f":"IF(ISNA(MATCH(B133,spisak!$F$4:$F$308,0)),\"bye\",INDEX(spisak!$B$4:$B$308,MATCH(B133,spisak!$F$4:$F$308,0)))","v":"Ivailo Bojanov"},{"$f":"INDEX(F136:F141,MATCH(D131&D133,C136:C141&D136:D141,0))&\"/\"&INDEX(E136:E141,MATCH(D131&D133,C136:C141&D136:D141,0))","v":"0/3"},null,{"$f":"INDEX(F136:F141,MATCH(D132&D133,C136:C141&D136:D141,0))&\"/\"&INDEX(E136:E141,MATCH(D132&D133,C136:C141&D136:D141,0))","v":"0/3"},{"$nulls":3},{"$f":"INDEX(E136:E141,MATCH(D133&D134,C136:C141&D136:D141,0))&\"/\"&INDEX(F136:F141,MATCH(D133&D134,C136:C141&D136:D141,0))","v":"/"},null,{"$f":"IF(ISBLANK(partije!$J$2),\"\",COUNTIFS(C136:C141,D133,E136:E141,3)+COUNTIFS(D136:D141,D133,F136:F141,3))","v":0},{"$f":"IF(ISBLANK(partije!$J$2),\"\",COUNTIFS(C136:C141,D133,E136:E141,\"<3\")+COUNTIFS(D136:D141,D133,F136:F141,\"<3\"))","v":2},3,3,{"$f":"IF(ISBLANK(D133),\"*\",INDEX(D131:D134,MATCH(P133,O131:O134,0)))","v":"Ivailo Bojanov"}]
[4,{"v":104,"d":"10-4"},{"$f":"IF(ISNA(MATCH(B134,spisak!$F$4:$F$308,0)),\"\",INDEX(spisak!$C$4:$C$308,MATCH(B134,spisak!$F$4:$F$308,0)))","v":""},{"$f":"IF(ISNA(MATCH(B134,spisak!$F$4:$F$308,0)),\"bye\",INDEX(spisak!$B$4:$B$308,MATCH(B134,spisak!$F$4:$F$308,0)))","v":"bye"},{"$f":"INDEX(F136:F141,MATCH(D131&D134,C136:C141&D136:D141,0))&\"/\"&INDEX(E136:E141,MATCH(D131&D134,C136:C141&D136:D141,0))","v":"/"},null,{"$f":"INDEX(F136:F141,MATCH(D132&D134,C136:C141&D136:D141,0))&\"/\"&INDEX(E136:E141,MATCH(D132&D134,C136:C141&D136:D141,0))","v":"/"},null,{"$f":"INDEX(F136:F141,MATCH(D133&D134,C136:C141&D136:D141,0))&\"/\"&INDEX(E136:E141,MATCH(D133&D134,C136:C141&D136:D141,0))","v":"/"},{"$nulls":3},{"$f":"IF(ISBLANK(partije!$J$2),\"\",COUNTIFS(C136:C141,D134,E136:E141,3)+COUNTIFS(D136:D141,D134,F136:F141,3))","v":0},{"$f":"IF(ISBLANK(partije!$J$2),\"\",COUNTIFS(C136:C141,D134,E136:E141,\"<3\")+COUNTIFS(D136:D141,D134,F136:F141,\"<3\"))","v":0},null,4,{"$f":"IF(ISBLANK(D134),\"*\",INDEX(D131:D134,MATCH(P134,O131:O134,0)))","v":{"$error":"#N/A"}}]
[{"$nulls":4},"rezultat",null,"set1",null,"set 2",null,"set 3",null,"set 4","set 5","set 6","set 7",null,null,"berger4"]
[{"$f":"IF(ISBLANK(partije!D20),\"\",partije!D20)","v":""},{"$f":"IF(ISBLANK(partije!E20),\"\",partije!E20)","v":""},{"$f":"INDEX(D131:D134,MATCH(S136,A131:A134,0))","v":"Rajić Borislav"},{"$f":"INDEX(D131:D134,MATCH(T136,A131:A134,0))","v":"Ivailo Bojanov"},{"$f":"IF(ISBLANK(partije!J20),\"\",partije!J20)","v":3},{"$f":"IF(ISBLANK(partije!K20),\"\",partije!K20)","v":0},{"$f":"IF(ISBLANK(partije!L20),\"\",partije!L20)","v":{"v":1106,"d":"11-06"}},null,{"$f":"IF(ISBLANK(partije!M20),\"\",partije!M20)","v":{"v":1104,"d":"11-04"}},null,{"$f":"IF(ISBLANK(partije!N20),\"\",partije!N20)","v":{"v":1105,"d":"11-05"}},{"$f":"IF(ISBLANK(partije!M20),\"\",partije!M20)","v":{"v":1104,"d":"11-04"}},{"$f":"IF(ISBLANK(partije!O20),\"\",partije!O20)","v":""},{"$f":"IF(ISBLANK(partije!P20),\"\",partije!P20)","v":""},{"$f":"IF(ISBLANK(partije!Q20),\"\",partije!Q20)","v":""},{"$f":"IF(ISBLANK(partije!R20),\"\",partije!R20)","v":""},{"$f":"IF(ISBLANK(partije!$D$20),\"\",partije!$D$20)","v":""},{"$f":"IF(ISBLANK(partije!$E$20),\"\",\"sto \"&partije!$E$20)","v":""},{"$f":"$S$10","v":1},{"$f":"$T$10","v":3}]
[{"$f":"IF(ISBLANK(partije!D21),\"\",partije!D21)","v":""},{"$f":"IF(ISBLANK(partije!E21),\"\",partije!E21)","v":""},{"$f":"INDEX(D131:D134,MATCH(S137,A131:A134,0))","v":"Konstantinov Marko"},{"$f":"INDEX(D131:D134,MATCH(T137,A131:A134,0))","v":"bye"},{"$f":"IF(ISBLANK(partije!J21),\"\",partije!J21)","v":""},{"$f":"IF(ISBLANK(partije!K21),\"\",partije!K21)","v":""},{"$f":"IF(ISBLANK(partije!L21),\"\",partije!L21)","v":""},null,{"$f":"IF(ISBLANK(partije!M21),\"\",partije!M21)","v":""},null,{"$f":"IF(ISBLANK(partije!N21),\"\",partije!N21)","v":""},{"$f":"IF(ISBLANK(partije!M21),\"\",partije!M21)","v":""},{"$f":"IF(ISBLANK(partije!O21),\"\",partije!O21)","v":""},{"$f":"IF(ISBLANK(partije!P21),\"\",partije!P21)","v":""},{"$f":"IF(ISBLANK(partije!Q21),\"\",partije!Q21)","v":""},{"$f":"IF(ISBLANK(partije!R21),\"\",partije!R21)","v":""},{"$f":"IF(ISBLANK(partije!$D$21),\"\",partije!$D$21)","v":""},{"$f":"IF(ISBLANK(partije!$E$21),\"\",\"sto \"&partije!$E$21)","v":""},{"$f":"$S$11","v":2},{"$f":"$T$11","v":4}]
[{"$f":"IF(ISBLANK(partije!D86),\"\",partije!D86)","v":""},{"$f":"IF(ISBLANK(partije!E86),\"\",partije!E86)","v":""},{"$f":"INDEX(D131:D134,MATCH(S138,A131:A134,0))","v":"Rajić Borislav"},{"$f":"INDEX(D131:D134,MATCH(T138,A131:A134,0))","v":"Konstantinov Marko"},{"$f":"IF(ISBLANK(partije!J86),\"\",partije!J86)","v":3},{"$f":"IF(ISBLANK(partije!K86),\"\",partije!K86)","v":1},{"$f":"IF(ISBLANK(partije!L86),\"\",partije!L86)","v":{"v":811,"d":"08-11"}},null,{"$f":"IF(ISBLANK(partije!M86),\"\",partije!M86)","v":{"v":1109,"d":"11-09"}},null,{"$f":"IF(ISBLANK(partije!N86),\"\",partije!N86)","v":{"v":1108,"d":"11-08"}},{"$f":"IF(ISBLANK(partije!M86),\"\",partije!M86)","v":{"v":1109,"d":"11-09"}},{"$f":"IF(ISBLANK(partije!O86),\"\",partije!O86)","v":{"v":1109,"d":"11-09"}},{"$f":"IF(ISBLANK(partije!P86),\"\",partije!P86)","v":""},{"$f":"IF(ISBLANK(partije!Q86),\"\",partije!Q86)","v":""},{"$f":"IF(ISBLANK(partije!R86),\"\",partije!R86)","v":""},{"$f":"IF(ISBLANK(partije!$D$86),\"\",partije!$D$86)","v":""},{"$f":"IF(ISBLANK(partije!$E$86),\"\",\"sto \"&partije!$E$86)","v":""},{"$f":"$S$12","v":1},{"$f":"$T$12","v":2}]
[{"$f":"IF(ISBLANK(partije!D87),\"\",partije!D87)","v":""},{"$f":"IF(ISBLANK(partije!E87),\"\",partije!E87)","v":""},{"$f":"INDEX(D131:D134,MATCH(S139,A131:A134,0))","v":"Ivailo Bojanov"},{"$f":"INDEX(D131:D134,MATCH(T139,A131:A134,0))","v":"bye"},{"$f":"IF(ISBLANK(partije!J87),\"\",partije!J87)","v":""},{"$f":"IF(ISBLANK(partije!K87),\"\",partije!K87)","v":""},{"$f":"IF(ISBLANK(partije!L87),\"\",partije!L87)","v":""},null,{"$f":"IF(ISBLANK(partije!M87),\"\",partije!M87)","v":""},null,{"$f":"IF(ISBLANK(partije!N87),\"\",partije!N87)","v":""},{"$f":"IF(ISBLANK(partije!M87),\"\",partije!M87)","v":""},{"$f":"IF(ISBLANK(partije!O87),\"\",partije!O87)","v":""},{"$f":"IF(ISBLANK(partije!P87),\"\",partije!P87)","v":""},{"$f":"IF(ISBLANK(partije!Q87),\"\",partije!Q87)","v":""},{"$f":"IF(ISBLANK(partije!R87),\"\",partije!R87)","v":""},{"$f":"IF(ISBLANK(partije!$D$87),\"\",partije!$D$87)","v":""},{"$f":"IF(ISBLANK(partije!$E$87),\"\",\"sto \"&partije!$E$87)","v":""},{"$f":"$S$13","v":3},{"$f":"$T$13","v":4}]
[{"$f":"IF(ISBLANK(partije!D152),\"\",partije!D152)","v":""},{"$f":"IF(ISBLANK(partije!E152),\"\",partije!E152)","v":""},{"$f":"INDEX(D131:D134,MATCH(S140,A131:A134,0))","v":"Rajić Borislav"},{"$f":"INDEX(D131:D134,MATCH(T140,A131:A134,0))","v":"bye"},{"$f":"IF(ISBLANK(partije!J152),\"\",partije!J152)","v":""},{"$f":"IF(ISBLANK(partije!K152),\"\",partije!K152)","v":""},{"$f":"IF(ISBLANK(partije!L152),\"\",partije!L152)","v":""},null,{"$f":"IF(ISBLANK(partije!M152),\"\",partije!M152)","v":""},null,{"$f":"IF(ISBLANK(partije!N152),\"\",partije!N152)","v":""},{"$f":"IF(ISBLANK(partije!M152),\"\",partije!M152)","v":""},{"$f":"IF(ISBLANK(partije!O152),\"\",partije!O152)","v":""},{"$f":"IF(ISBLANK(partije!P152),\"\",partije!P152)","v":""},{"$f":"IF(ISBLANK(partije!Q152),\"\",partije!Q152)","v":""},{"$f":"IF(ISBLANK(partije!R152),\"\",partije!R152)","v":""},{"$f":"IF(ISBLANK(partije!$D$152),\"\",partije!$D$152)","v":""},{"$f":"IF(ISBLANK(partije!$E$152),\"\",\"sto \"&partije!$E$152)","v":""},{"$f":"$S$14","v":1},{"$f":"$T$14","v":4}]
[{"$f":"IF(ISBLANK(partije!D153),\"\",partije!D153)","v":""},{"$f":"IF(ISBLANK(partije!E153),\"\",partije!E153)","v":""},{"$f":"INDEX(D131:D134,MATCH(S141,A131:A134,0))","v":"Konstantinov Marko"},{"$f":"INDEX(D131:D134,MATCH(T141,A131:A134,0))","v":"Ivailo Bojanov"},{"$f":"IF(ISBLANK(partije!J153),\"\",partije!J153)","v":3},{"$f":"IF(ISBLANK(partije!K153),\"\",partije!K153)","v":0},{"$f":"IF(ISBLANK(partije!L153),\"\",partije!L153)","v":{"v":1108,"d":"11-08"}},null,{"$f":"IF(ISBLANK(partije!M153),\"\",partije!M153)","v":{"v":1210,"d":"12-10"}},null,{"$f":"IF(ISBLANK(partije!N153),\"\",partije!N153)","v":{"v":1101,"d":"11-01"}},{"$f":"IF(ISBLANK(partije!M153),\"\",partije!M153)","v":{"v":1210,"d":"12-10"}},{"$f":"IF(ISBLANK(partije!O153),\"\",partije!O153)","v":""},{"$f":"IF(ISBLANK(partije!P153),\"\",partije!P153)","v":""},{"$f":"IF(ISBLANK(partije!Q153),\"\",partije!Q153)","v":""},{"$f":"IF(ISBLANK(partije!R153),\"\",partije!R153)","v":""},{"$f":"IF(ISBLANK(partije!$D$153),\"\",partije!$D$153)","v":""},{"$f":"IF(ISBLANK(partije!$E$153),\"\",\"sto \"&partije!$E$153)","v":""},{"$f":"$S$15","v":2},{"$f":"$T$15","v":3}]
[]
[{"$nulls":3},"grupa 11"]
[null,"br.",null,"igrač",1,null,2,null,3,null,4,null,"pobede","porazi","mesto",null,"plasman grupe 11"]
[1,{"v":111,"d":"11-1"},{"$f":"IF(ISNA(MATCH(B145,spisak!$F$4:$F$308,0)),\"\",INDEX(spisak!$C$4:$C$308,MATCH(B145,spisak!$F$4:$F$308,0)))","v":"Barajevo"},{"$f":"IF(ISNA(MATCH(B145,spisak!$F$4:$F$308,0)),\"bye\",INDEX(spisak!$B$4:$B$308,MATCH(B145,spisak!$F$4:$F$308,0)))","v":"Marinković Vasilije"},null,null,{"$f":"INDEX(E150:E155,MATCH(D145&D146,C150:C155&D150:D155,0))&\"/\"&INDEX(F150:F155,MATCH(D145&D146,C150:C155&D150:D155,0))","v":"3/0"},null,{"$f":"INDEX(E150:E155,MATCH(D145&D147,C150:C155&D150:D155,0))&\"/\"&INDEX(F150:F155,MATCH(D145&D147,C150:C155&D150:D155,0))","v":"3/0"},null,{"$f":"INDEX(E150:E155,MATCH(D145&D148,C150:C155&D150:D155,0))&\"/\"&INDEX(F150:F155,MATCH(D145&D148,C150:C155&D150:D155,0))","v":"/"},null,{"$f":"IF(ISBLANK(partije!$J$2),\"\",COUNTIFS(C150:C155,D145,E150:E155,3)+COUNTIFS(D150:D155,D145,F150:F155,3))","v":2},{"$f":"IF(ISBLANK(partije!$J$2),\"\",COUNTIFS(C150:C155,D145,E150:E155,\"<3\")+COUNTIFS(D150:D155,D145,F150:F155,\"<3\"))","v":0},1,1,{"$f":"IF(ISBLANK(D145),\"*\",INDEX(D145:D148,MATCH(P145,O145:O148,0)))","v":"Marinković Vasilije"}]
[2,{"v":112,"d":"11-2"},{"$f":"IF(ISNA(MATCH(B146,spisak!$F$4:$F$308,0)),\"\",INDEX(spisak!$C$4:$C$308,MATCH(B146,spisak!$F$4:$F$308,0)))","v":"Novi Sad"},{"$f":"IF(ISNA(MATCH(B146,spisak!$F$4:$F$308,0)),\"bye\",INDEX(spisak!$B$4:$B$308,MATCH(B146,spisak!$F$4:$F$308,0)))","v":"Stefanović Luka"},{"$f":"INDEX(F150:F155,MATCH(D145&D146,C150:C155&D150:D155,0))&\"/\"&INDEX(E150:E155,MATCH(D145&D146,C150:C155&D150:D155,0))","v":"0/3"},{"$nulls":3},{"$f":"INDEX(E150:E155,MATCH(D146&D147,C150:C155&D150:D155,0))&\"/\"&INDEX(F150:F155,MATCH(D146&D147,C150:C155&D150:D155,0))","v":"3/1"},null,{"$f":"INDEX(E150:E155,MATCH(D146&D148,C150:C155&D150:D155,0))&\"/\"&INDEX(F150:F155,MATCH(D146&D148,C150:C155&D150:D155,0))","v":"/"},null,{"$f":"IF(ISBLANK(partije!$J$2),\"\",COUNTIFS(C150:C155,D146,E150:E155,3)+COUNTIFS(D150:D155,D146,F150:F155,3))","v":1},{"$f":"IF(ISBLANK(partije!$J$2),\"\",COUNTIFS(C150:C155,D146,E150:E155,\"<3\")+COUNTIFS(D150:D155,D146,F150:F155,\"<3\"))","v":1},2,2,{"$f":"IF(ISBLANK(D146),\"*\",INDEX(D145:D148,MATCH(P146,O145:O148,0)))","v":"Stefanović Luka"}]
[3,{"v":113,"d":"11-3"},{"$f":"IF(ISNA(MATCH(B147,spisak!$F$4:$F$308,0)),\"\",INDEX(spisak!$C$4:$C$308,MATCH(B147,spisak!$F$4:$F$308,0)))","v":"Napad"},{"$f":"IF(ISNA(MATCH(B147,spisak!$F$4:$F$308,0)),\"bye\",INDEX(spisak!$B$4:$B$308,MATCH(B147,spisak!$F$4:$F$308,0)))","v":"Orolić Đorđe"},{"$f":"INDEX(F150:F155,MATCH(D145&D147,C150:C155&D150:D155,0))&\"/\"&INDEX(E150:E155,MATCH(D145&D147,C150:C155&D150:D155,0))","v":"0/3"},null,{"$f":"INDEX(F150:F155,MATCH(D146&D147,C150:C155&D150:D155,0))&\"/\"&INDEX(E150:E155,MATCH(D146&D147,C150:C155&D150:D155,0))","v":"1/3"},{"$nulls":3},{"$f":"INDEX(E150:E155,MATCH(D147&D148,C150:C155&D150:D155,0))&\"/\"&INDEX(F150:F155,MATCH(D147&D148,C150:C155&D150:D155,0))","v":"/"},null,{"$f":"IF(ISBLANK(partije!$J$2),\"\",COUNTIFS(C150:C155,D147,E150:E155,3)+COUNTIFS(D150:D155,D147,F150:F155,3))","v":0},{"$f":"IF(ISBLANK(partije!$J$2),\"\",COUNTIFS(C150:C155,D147,E150:E155,\"<3\")+COUNTIFS(D150:D155,D147,F150:F155,\"<3\"))","v":2},3,3,{"$f":"IF(ISBLANK(D147),\"*\",INDEX(D145:D148,MATCH(P147,O145:O148,0)))","v":"Orolić Đorđe"}]
[4,{"v":114,"d":"11-4"},{"$f":"IF(ISNA(MATCH(B148,spisak!$F$4:$F$308,0)),\"\",INDEX(spisak!$C$4:$C$308,MATCH(B148,spisak!$F$4:$F$308,0)))","v":""},{"$f":"IF(ISNA(MATCH(B148,spisak!$F$4:$F$308,0)),\"bye\",INDEX(spisak!$B$4:$B$308,MATCH(B148,spisak!$F$4:$F$308,0)))","v":"bye"},{"$f":"INDEX(F150:F155,MATCH(D145&D148,C150:C155&D150:D155,0))&\"/\"&INDEX(E150:E155,MATCH(D145&D148,C150:C155&D150:D155,0))","v":"/"},null,{"$f":"INDEX(F150:F155,MATCH(D146&D148,C150:C155&D150:D155,0))&\"/\"&INDEX(E150:E155,MATCH(D146&D148,C150:C155&D150:D155,0))","v":"/"},null,{"$f":"INDEX(F150:F155,MATCH(D147&D148,C150:C155&D150:D155,0))&\"/\"&INDEX(E150:E155,MATCH(D147&D148,C150:C155&D150:D155,0))","v":"/"},{"$nulls":3},{"$f":"IF(ISBLANK(partije!$J$2),\"\",COUNTIFS(C150:C155,D148,E150:E155,3)+COUNTIFS(D150:D155,D148,F150:F155,3))","v":0},{"$f":"IF(ISBLANK(partije!$J$2),\"\",COUNTIFS(C150:C155,D148,E150:E155,\"<3\")+COUNTIFS(D150:D155,D148,F150:F155,\"<3\"))","v":0},null,4,{"$f":"IF(ISBLANK(D148),\"*\",INDEX(D145:D148,MATCH(P148,O145:O148,0)))","v":{"$error":"#N/A"}},null,"berger4"]
[{"$nulls":4},"rezultat",null,"set1",null,"set 2",null,"set 3",null,"set 4","set 5","set 6","set 7"]
[{"$f":"IF(ISBLANK(partije!D22),\"\",partije!D22)","v":""},{"$f":"IF(ISBLANK(partije!E22),\"\",partije!E22)","v":""},{"$f":"INDEX(D145:D148,MATCH(S150,A145:A148,0))","v":"Marinković Vasilije"},{"$f":"INDEX(D145:D148,MATCH(T150,A145:A148,0))","v":"Orolić Đorđe"},{"$f":"IF(ISBLANK(partije!J22),\"\",partije!J22)","v":3},{"$f":"IF(ISBLANK(partije!K22),\"\",partije!K22)","v":0},{"$f":"IF(ISBLANK(partije!L22),\"\",partije!L22)","v":{"v":1107,"d":"11-07"}},null,{"$f":"IF(ISBLANK(partije!M22),\"\",partije!M22)","v":{"v":1105,"d":"11-05"}},null,{"$f":"IF(ISBLANK(partije!N22),\"\",partije!N22)","v":{"v":1108,"d":"11-08"}},{"$f":"IF(ISBLANK(partije!M22),\"\",partije!M22)","v":{"v":1105,"d":"11-05"}},{"$f":"IF(ISBLANK(partije!O22),\"\",partije!O22)","v":""},{"$f":"IF(ISBLANK(partije!P22),\"\",partije!P22)","v":""},{"$f":"IF(ISBLANK(partije!Q22),\"\",partije!Q22)","v":""},{"$f":"IF(ISBLANK(partije!R22),\"\",partije!R22)","v":""},{"$f":"IF(ISBLANK(partije!$D$22),\"\",partije!$D$22)","v":""},{"$f":"IF(ISBLANK(partije!$E$22),\"\",\"sto \"&partije!$E$22)","v":""},{"$f":"$S$10","v":1},{"$f":"$T$10","v":3}]
[{"$f":"IF(ISBLANK(partije!D23),\"\",partije!D23)","v":""},{"$f":"IF(ISBLANK(partije!E23),\"\",partije!E23)","v":""},{"$f":"INDEX(D145:D148,MATCH(S151,A145:A148,0))","v":"Stefanović Luka"},{"$f":"INDEX(D145:D148,MATCH(T151,A145:A148,0))","v":"bye"},{"$f":"IF(ISBLANK(partije!J23),\"\",partije!J23)","v":""},{"$f":"IF(ISBLANK(partije!K23),\"\",partije!K23)","v":""},{"$f":"IF(ISBLANK(partije!L23),\"\",partije!L23)","v":""},null,{"$f":"IF(ISBLANK(partije!M23),\"\",partije!M23)","v":""},null,{"$f":"IF(ISBLANK(partije!N23),\"\",partije!N23)","v":""},{"$f":"IF(ISBLANK(partije!M23),\"\",partije!M23)","v":""},{"$f":"IF(ISBLANK(partije!O23),\"\",partije!O23)","v":""},{"$f":"IF(ISBLANK(partije!P23),\"\",partije!P23)","v":""},{"$f":"IF(ISBLANK(partije!Q23),\"\",partije!Q23)","v":""},{"$f":"IF(ISBLANK(partije!R23),\"\",partije!R23)","v":""},{"$f":"IF(ISBLANK(partije!$D$23),\"\",partije!$D$23)","v":""},{"$f":"IF(ISBLANK(partije!$E$23),\"\",\"sto \"&partije!$E$23)","v":""},{"$f":"$S$11","v":2},{"$f":"$T$11","v":4}]
[{"$f":"IF(ISBLANK(partije!D88),\"\",partije!D88)","v":""},{"$f":"IF(ISBLANK(partije!E88),\"\",partije!E88)","v":""},{"$f":"INDEX(D145:D148,MATCH(S152,A145:A148,0))","v":"Marinković Vasilije"},{"$f":"INDEX(D145:D148,MATCH(T152,A145:A148,0))","v":"Stefanović Luka"},{"$f":"IF(ISBLANK(partije!J88),\"\",partije!J88)","v":3},{"$f":"IF(ISBLANK(partije!K88),\"\",partije!K88)","v":0},{"$f":"IF(ISBLANK(partije!L88),\"\",partije!L88)","v":{"v":1105,"d":"11-05"}},null,{"$f":"IF(ISBLANK(partije!M88),\"\",partije!M88)","v":{"v":1108,"d":"11-08"}},null,{"$f":"IF(ISBLANK(partije!N88),\"\",partije!N88)","v":{"v":1107,"d":"11-07"}},{"$f":"IF(ISBLANK(partije!M88),\"\",partije!M88)","v":{"v":1108,"d":"11-08"}},{"$f":"IF(ISBLANK(partije!O88),\"\",partije!O88)","v":""},{"$f":"IF(ISBLANK(partije!P88),\"\",partije!P88)","v":""},{"$f":"IF(ISBLANK(partije!Q88),\"\",partije!Q88)","v":""},{"$f":"IF(ISBLANK(partije!R88),\"\",partije!R88)","v":""},{"$f":"IF(ISBLANK(partije!$D$88),\"\",partije!$D$88)","v":""},{"$f":"IF(ISBLANK(partije!$E$88),\"\",\"sto \"&partije!$E$88)","v":""},{"$f":"$S$12","v":1},{"$f":"$T$12","v":2}]
[{"$f":"IF(ISBLANK(partije!D89),\"\",partije!D89)","v":""},{"$f":"IF(ISBLANK(partije!E89),\"\",partije!E89)","v":""},{"$f":"INDEX(D145:D148,MATCH(S153,A145:A148,0))","v":"Orolić Đorđe"},{"$f":"INDEX(D145:D148,MATCH(T153,A145:A148,0))","v":"bye"},{"$f":"IF(ISBLANK(partije!J89),\"\",partije!J89)","v":""},{"$f":"IF(ISBLANK(partije!K89),\"\",partije!K89)","v":""},{"$f":"IF(ISBLANK(partije!L89),\"\",partije!L89)","v":""},null,{"$f":"IF(ISBLANK(partije!M89),\"\",partije!M89)","v":""},null,{"$f":"IF(ISBLANK(partije!N89),\"\",partije!N89)","v":""},{"$f":"IF(ISBLANK(partije!M89),\"\",partije!M89)","v":""},{"$f":"IF(ISBLANK(partije!O89),\"\",partije!O89)","v":""},{"$f":"IF(ISBLANK(partije!P89),\"\",partije!P89)","v":""},{"$f":"IF(ISBLANK(partije!Q89),\"\",partije!Q89)","v":""},{"$f":"IF(ISBLANK(partije!R89),\"\",partije!R89)","v":""},{"$f":"IF(ISBLANK(partije!$D$89),\"\",partije!$D$89)","v":""},{"$f":"IF(ISBLANK(partije!$E$89),\"\",\"sto \"&partije!$E$89)","v":""},{"$f":"$S$13","v":3},{"$f":"$T$13","v":4}]
[{"$f":"IF(ISBLANK(partije!D154),\"\",partije!D154)","v":""},{"$f":"IF(ISBLANK(partije!E154),\"\",partije!E154)","v":""},{"$f":"INDEX(D145:D148,MATCH(S154,A145:A148,0))","v":"Marinković Vasilije"},{"$f":"INDEX(D145:D148,MATCH(T154,A145:A148,0))","v":"bye"},{"$f":"IF(ISBLANK(partije!J154),\"\",partije!J154)","v":""},{"$f":"IF(ISBLANK(partije!K154),\"\",partije!K154)","v":""},{"$f":"IF(ISBLANK(partije!L154),\"\",partije!L154)","v":""},null,{"$f":"IF(ISBLANK(partije!M154),\"\",partije!M154)","v":""},null,{"$f":"IF(ISBLANK(partije!N154),\"\",partije!N154)","v":""},{"$f":"IF(ISBLANK(partije!M154),\"\",partije!M154)","v":""},{"$f":"IF(ISBLANK(partije!O154),\"\",partije!O154)","v":""},{"$f":"IF(ISBLANK(partije!P154),\"\",partije!P154)","v":""},{"$f":"IF(ISBLANK(partije!Q154),\"\",partije!Q154)","v":""},{"$f":"IF(ISBLANK(partije!R154),\"\",partije!R154)","v":""},{"$f":"IF(ISBLANK(partije!$D$154),\"\",partije!$D$154)","v":""},{"$f":"IF(ISBLANK(partije!$E$154),\"\",\"sto \"&partije!$E$154)","v":""},{"$f":"$S$14","v":1},{"$f":"$T$14","v":4}]
[{"$f":"IF(ISBLANK(partije!D155),\"\",partije!D155)","v":""},{"$f":"IF(ISBLANK(partije!E155),\"\",partije!E155)","v":""},{"$f":"INDEX(D145:D148,MATCH(S155,A145:A148,0))","v":"Stefanović Luka"},{"$f":"INDEX(D145:D148,MATCH(T155,A145:A148,0))","v":"Orolić Đorđe"},{"$f":"IF(ISBLANK(partije!J155),\"\",partije!J155)","v":3},{"$f":"IF(ISBLANK(partije!K155),\"\",partije!K155)","v":1},{"$f":"IF(ISBLANK(partije!L155),\"\",partije!L155)","v":{"v":1105,"d":"11-05"}},null,{"$f":"IF(ISBLANK(partije!M155),\"\",partije!M155)","v":{"v":1311,"d":"13-11"}},null,{"$f":"IF(ISBLANK(partije!N155),\"\",partije!N155)","v":{"v":811,"d":"08-11"}},{"$f":"IF(ISBLANK(partije!M155),\"\",partije!M155)","v":{"v":1311,"d":"13-11"}},{"$f":"IF(ISBLANK(partije!O155),\"\",partije!O155)","v":{"v":1210,"d":"12-10"}},{"$f":"IF(ISBLANK(partije!P155),\"\",partije!P155)","v":""},{"$f":"IF(ISBLANK(partije!Q155),\"\",partije!Q155)","v":""},{"$f":"IF(ISBLANK(partije!R155),\"\",partije!R155)","v":""},{"$f":"IF(ISBLANK(partije!$D$155),\"\",partije!$D$155)","v":""},{"$f":"IF(ISBLANK(partije!$E$155),\"\",\"sto \"&partije!$E$155)","v":""},{"$f":"$S$15","v":2},{"$f":"$T$15","v":3}]
[]
[{"$nulls":3},"grupa 12"]
[null,"br.",null,"igrač",1,null,2,null,3,null,4,null,"pobede","porazi","mesto",null,"plasman grupe 12"]
[1,{"v":121,"d":"12-1"},{"$f":"IF(ISNA(MATCH(B159,spisak!$F$4:$F$308,0)),\"\",INDEX(spisak!$C$4:$C$308,MATCH(B159,spisak!$F$4:$F$308,0)))","v":"Milenijum"},{"$f":"IF(ISNA(MATCH(B159,spisak!$F$4:$F$308,0)),\"bye\",INDEX(spisak!$B$4:$B$308,MATCH(B159,spisak!$F$4:$F$308,0)))","v":"Radonjić Stefan"},null,null,{"$f":"INDEX(E164:E169,MATCH(D159&D160,C164:C169&D164:D169,0))&\"/\"&INDEX(F164:F169,MATCH(D159&D160,C164:C169&D164:D169,0))","v":"3/0"},null,{"$f":"INDEX(E164:E169,MATCH(D159&D161,C164:C169&D164:D169,0))&\"/\"&INDEX(F164:F169,MATCH(D159&D161,C164:C169&D164:D169,0))","v":"3/0"},null,{"$f":"INDEX(E164:E169,MATCH(D159&D162,C164:C169&D164:D169,0))&\"/\"&INDEX(F164:F169,MATCH(D159&D162,C164:C169&D164:D169,0))","v":"/"},null,{"$f":"IF(ISBLANK(partije!$J$2),\"\",COUNTIFS(C164:C169,D159,E164:E169,3)+COUNTIFS(D164:D169,D159,F164:F169,3))","v":2},{"$f":"IF(ISBLANK(partije!$J$2),\"\",COUNTIFS(C164:C169,D159,E164:E169,\"<3\")+COUNTIFS(D164:D169,D159,F164:F169,\"<3\"))","v":0},1,1,{"$f":"IF(ISBLANK(D159),\"*\",INDEX(D159:D162,MATCH(P159,O159:O162,0)))","v":"Radonjić Stefan"}]
[2,{"v":122,"d":"12-2"},{"$f":"IF(ISNA(MATCH(B160,spisak!$F$4:$F$308,0)),\"\",INDEX(spisak!$C$4:$C$308,MATCH(B160,spisak!$F$4:$F$308,0)))","v":"Vojvodina  Novi Sad"},{"$f":"IF(ISNA(MATCH(B160,spisak!$F$4:$F$308,0)),\"bye\",INDEX(spisak!$B$4:$B$308,MATCH(B160,spisak!$F$4:$F$308,0)))","v":"Marković Jovan"},{"$f":"INDEX(F164:F169,MATCH(D159&D160,C164:C169&D164:D169,0))&\"/\"&INDEX(E164:E169,MATCH(D159&D160,C164:C169&D164:D169,0))","v":"0/3"},{"$nulls":3},{"$f":"INDEX(E164:E169,MATCH(D160&D161,C164:C169&D164:D169,0))&\"/\"&INDEX(F164:F169,MATCH(D160&D161,C164:C169&D164:D169,0))","v":"3/2"},null,{"$f":"INDEX(E164:E169,MATCH(D160&D162,C164:C169&D164:D169,0))&\"/\"&INDEX(F164:F169,MATCH(D160&D162,C164:C169&D164:D169,0))","v":"/"},null,{"$f":"IF(ISBLANK(partije!$J$2),\"\",COUNTIFS(C164:C169,D160,E164:E169,3)+COUNTIFS(D164:D169,D160,F164:F169,3))","v":1},{"$f":"IF(ISBLANK(partije!$J$2),\"\",COUNTIFS(C164:C169,D160,E164:E169,\"<3\")+COUNTIFS(D164:D169,D160,F164:F169,\"<3\"))","v":1},2,2,{"$f":"IF(ISBLANK(D160),\"*\",INDEX(D159:D162,MATCH(P160,O159:O162,0)))","v":"Marković Jovan"}]
[3,{"v":123,"d":"12-3"},{"$f":"IF(ISNA(MATCH(B161,spisak!$F$4:$F$308,0)),\"\",INDEX(spisak!$C$4:$C$308,MATCH(B161,spisak!$F$4:$F$308,0)))","v":"Dubočica Leskovac"},{"$f":"IF(ISNA(MATCH(B161,spisak!$F$4:$F$308,0)),\"bye\",INDEX(spisak!$B$4:$B$308,MATCH(B161,spisak!$F$4:$F$308,0)))","v":"Ilič Gavrilo"},{"$f":"INDEX(F164:F169,MATCH(D159&D161,C164:C169&D164:D169,0))&\"/\"&INDEX(E164:E169,MATCH(D159&D161,C164:C169&D164:D169,0))","v":"0/3"},null,{"$f":"INDEX(F164:F169,MATCH(D160&D161,C164:C169&D164:D169,0))&\"/\"&INDEX(E164:E169,MATCH(D160&D161,C164:C169&D164:D169,0))","v":"2/3"},{"$nulls":3},{"$f":"INDEX(E164:E169,MATCH(D161&D162,C164:C169&D164:D169,0))&\"/\"&INDEX(F164:F169,MATCH(D161&D162,C164:C169&D164:D169,0))","v":"/"},null,{"$f":"IF(ISBLANK(partije!$J$2),\"\",COUNTIFS(C164:C169,D161,E164:E169,3)+COUNTIFS(D164:D169,D161,F164:F169,3))","v":0},{"$f":"IF(ISBLANK(partije!$J$2),\"\",COUNTIFS(C164:C169,D161,E164:E169,\"<3\")+COUNTIFS(D164:D169,D161,F164:F169,\"<3\"))","v":2},3,3,{"$f":"IF(ISBLANK(D161),\"*\",INDEX(D159:D162,MATCH(P161,O159:O162,0)))","v":"Ilič Gavrilo"}]
[4,{"v":124,"d":"12-4"},{"$f":"IF(ISNA(MATCH(B162,spisak!$F$4:$F$308,0)),\"\",INDEX(spisak!$C$4:$C$308,MATCH(B162,spisak!$F$4:$F$308,0)))","v":""},{"$f":"IF(ISNA(MATCH(B162,spisak!$F$4:$F$308,0)),\"bye\",INDEX(spisak!$B$4:$B$308,MATCH(B162,spisak!$F$4:$F$308,0)))","v":"bye"},{"$f":"INDEX(F164:F169,MATCH(D159&D162,C164:C169&D164:D169,0))&\"/\"&INDEX(E164:E169,MATCH(D159&D162,C164:C169&D164:D169,0))","v":"/"},null,{"$f":"INDEX(F164:F169,MATCH(D160&D162,C164:C169&D164:D169,0))&\"/\"&INDEX(E164:E169,MATCH(D160&D162,C164:C169&D164:D169,0))","v":"/"},null,{"$f":"INDEX(F164:F169,MATCH(D161&D162,C164:C169&D164:D169,0))&\"/\"&INDEX(E164:E169,MATCH(D161&D162,C164:C169&D164:D169,0))","v":"/"},{"$nulls":3},{"$f":"IF(ISBLANK(partije!$J$2),\"\",COUNTIFS(C164:C169,D162,E164:E169,3)+COUNTIFS(D164:D169,D162,F164:F169,3))","v":0},{"$f":"IF(ISBLANK(partije!$J$2),\"\",COUNTIFS(C164:C169,D162,E164:E169,\"<3\")+COUNTIFS(D164:D169,D162,F164:F169,\"<3\"))","v":0},null,4,{"$f":"IF(ISBLANK(D162),\"*\",INDEX(D159:D162,MATCH(P162,O159:O162,0)))","v":{"$error":"#N/A"}}]
[{"$nulls":4},"rezultat",null,"set1",null,"set 2",null,"set 3",null,"set 4","set 5","set 6","set 7",null,null,"berger4"]
[{"$f":"IF(ISBLANK(partije!D24),\"\",partije!D24)","v":""},{"$f":"IF(ISBLANK(partije!E24),\"\",partije!E24)","v":""},{"$f":"INDEX(D159:D162,MATCH(S164,A159:A162,0))","v":"Radonjić Stefan"},{"$f":"INDEX(D159:D162,MATCH(T164,A159:A162,0))","v":"Ilič Gavrilo"},{"$f":"IF(ISBLANK(partije!J24),\"\",partije!J24)","v":3},{"$f":"IF(ISBLANK(partije!K24),\"\",partije!K24)","v":0},{"$f":"IF(ISBLANK(partije!L24),\"\",partije!L24)","v":{"v":1106,"d":"11-06"}},null,{"$f":"IF(ISBLANK(partije!M24),\"\",partije!M24)","v":{"v":1106,"d":"11-06"}},null,{"$f":"IF(ISBLANK(partije!N24),\"\",partije!N24)","v":{"v":1109,"d":"11-09"}},{"$f":"IF(ISBLANK(partije!M24),\"\",partije!M24)","v":{"v":1106,"d":"11-06"}},{"$f":"IF(ISBLANK(partije!O24),\"\",partije!O24)","v":""},{"$f":"IF(ISBLANK(partije!P24),\"\",partije!P24)","v":""},{"$f":"IF(ISBLANK(partije!Q24),\"\",partije!Q24)","v":""},{"$f":"IF(ISBLANK(partije!R24),\"\",partije!R24)","v":""},{"$f":"IF(ISBLANK(partije!$D$24),\"\",partije!$D$24)","v":""},{"$f":"IF(ISBLANK(partije!$E$24),\"\",\"sto \"&partije!$E$24)","v":""},{"$f":"$S$10","v":1},{"$f":"$T$10","v":3}]
[{"$f":"IF(ISBLANK(partije!D25),\"\",partije!D25)","v":""},{"$f":"IF(ISBLANK(partije!E25),\"\",partije!E25)","v":""},{"$f":"INDEX(D159:D162,MATCH(S165,A159:A162,0))","v":"Marković Jovan"},{"$f":"INDEX(D159:D162,MATCH(T165,A159:A162,0))","v":"bye"},{"$f":"IF(ISBLANK(partije!J25),\"\",partije!J25)","v":""},{"$f":"IF(ISBLANK(partije!K25),\"\",partije!K25)","v":""},{"$f":"IF(ISBLANK(partije!L25),\"\",partije!L25)","v":""},null,{"$f":"IF(ISBLANK(partije!M25),\"\",partije!M25)","v":""},null,{"$f":"IF(ISBLANK(partije!N25),\"\",partije!N25)","v":""},{"$f":"IF(ISBLANK(partije!M25),\"\",partije!M25)","v":""},{"$f":"IF(ISBLANK(partije!O25),\"\",partije!O25)","v":""},{"$f":"IF(ISBLANK(partije!P25),\"\",partije!P25)","v":""},{"$f":"IF(ISBLANK(partije!Q25),\"\",partije!Q25)","v":""},{"$f":"IF(ISBLANK(partije!R25),\"\",partije!R25)","v":""},{"$f":"IF(ISBLANK(partije!$D$25),\"\",partije!$D$25)","v":""},{"$f":"IF(ISBLANK(partije!$E$25),\"\",\"sto \"&partije!$E$25)","v":""},{"$f":"$S$11","v":2},{"$f":"$T$11","v":4}]
[{"$f":"IF(ISBLANK(partije!D90),\"\",partije!D90)","v":""},{"$f":"IF(ISBLANK(partije!E90),\"\",partije!E90)","v":""},{"$f":"INDEX(D159:D162,MATCH(S166,A159:A162,0))","v":"Radonjić Stefan"},{"$f":"INDEX(D159:D162,MATCH(T166,A159:A162,0))","v":"Marković Jovan"},{"$f":"IF(ISBLANK(partije!J90),\"\",partije!J90)","v":3},{"$f":"IF(ISBLANK(partije!K90),\"\",partije!K90)","v":0},{"$f":"IF(ISBLANK(partije!L90),\"\",partije!L90)","v":{"v":1105,"d":"11-05"}},null,{"$f":"IF(ISBLANK(partije!M90),\"\",partije!M90)","v":{"v":1104,"d":"11-04"}},null,{"$f":"IF(ISBLANK(partije!N90),\"\",partije!N90)","v":{"v":1109,"d":"11-09"}},{"$f":"IF(ISBLANK(partije!M90),\"\",partije!M90)","v":{"v":1104,"d":"11-04"}},{"$f":"IF(ISBLANK(partije!O90),\"\",partije!O90)","v":""},{"$f":"IF(ISBLANK(partije!P90),\"\",partije!P90)","v":""},{"$f":"IF(ISBLANK(partije!Q90),\"\",partije!Q90)","v":""},{"$f":"IF(ISBLANK(partije!R90),\"\",partije!R90)","v":""},{"$f":"IF(ISBLANK(partije!$D$90),\"\",partije!$D$90)","v":""},{"$f":"IF(ISBLANK(partije!$E$90),\"\",\"sto \"&partije!$E$90)","v":""},{"$f":"$S$12","v":1},{"$f":"$T$12","v":2}]
[{"$f":"IF(ISBLANK(partije!D91),\"\",partije!D91)","v":""},{"$f":"IF(ISBLANK(partije!E91),\"\",partije!E91)","v":""},{"$f":"INDEX(D159:D162,MATCH(S167,A159:A162,0))","v":"Ilič Gavrilo"},{"$f":"INDEX(D159:D162,MATCH(T167,A159:A162,0))","v":"bye"},{"$f":"IF(ISBLANK(partije!J91),\"\",partije!J91)","v":""},{"$f":"IF(ISBLANK(partije!K91),\"\",partije!K91)","v":""},{"$f":"IF(ISBLANK(partije!L91),\"\",partije!L91)","v":""},null,{"$f":"IF(ISBLANK(partije!M91),\"\",partije!M91)","v":""},null,{"$f":"IF(ISBLANK(partije!N91),\"\",partije!N91)","v":""},{"$f":"IF(ISBLANK(partije!M91),\"\",partije!M91)","v":""},{"$f":"IF(ISBLANK(partije!O91),\"\",partije!O91)","v":""},{"$f":"IF(ISBLANK(partije!P91),\"\",partije!P91)","v":""},{"$f":"IF(ISBLANK(partije!Q91),\"\",partije!Q91)","v":""},{"$f":"IF(ISBLANK(partije!R91),\"\",partije!R91)","v":""},{"$f":"IF(ISBLANK(partije!$D$91),\"\",partije!$D$91)","v":""},{"$f":"IF(ISBLANK(partije!$E$91),\"\",\"sto \"&partije!$E$91)","v":""},{"$f":"$S$13","v":3},{"$f":"$T$13","v":4}]
[{"$f":"IF(ISBLANK(partije!D156),\"\",partije!D156)","v":""},{"$f":"IF(ISBLANK(partije!E156),\"\",partije!E156)","v":""},{"$f":"INDEX(D159:D162,MATCH(S168,A159:A162,0))","v":"Radonjić Stefan"},{"$f":"INDEX(D159:D162,MATCH(T168,A159:A162,0))","v":"bye"},{"$f":"IF(ISBLANK(partije!J156),\"\",partije!J156)","v":""},{"$f":"IF(ISBLANK(partije!K156),\"\",partije!K156)","v":""},{"$f":"IF(ISBLANK(partije!L156),\"\",partije!L156)","v":""},null,{"$f":"IF(ISBLANK(partije!M156),\"\",partije!M156)","v":""},null,{"$f":"IF(ISBLANK(partije!N156),\"\",partije!N156)","v":""},{"$f":"IF(ISBLANK(partije!M156),\"\",partije!M156)","v":""},{"$f":"IF(ISBLANK(partije!O156),\"\",partije!O156)","v":""},{"$f":"IF(ISBLANK(partije!P156),\"\",partije!P156)","v":""},{"$f":"IF(ISBLANK(partije!Q156),\"\",partije!Q156)","v":""},{"$f":"IF(ISBLANK(partije!R156),\"\",partije!R156)","v":""},{"$f":"IF(ISBLANK(partije!$D$156),\"\",partije!$D$156)","v":""},{"$f":"IF(ISBLANK(partije!$E$156),\"\",\"sto \"&partije!$E$156)","v":""},{"$f":"$S$14","v":1},{"$f":"$T$14","v":4}]
[{"$f":"IF(ISBLANK(partije!D157),\"\",partije!D157)","v":""},{"$f":"IF(ISBLANK(partije!E157),\"\",partije!E157)","v":""},{"$f":"INDEX(D159:D162,MATCH(S169,A159:A162,0))","v":"Marković Jovan"},{"$f":"INDEX(D159:D162,MATCH(T169,A159:A162,0))","v":"Ilič Gavrilo"},{"$f":"IF(ISBLANK(partije!J157),\"\",partije!J157)","v":3},{"$f":"IF(ISBLANK(partije!K157),\"\",partije!K157)","v":2},{"$f":"IF(ISBLANK(partije!L157),\"\",partije!L157)","v":{"v":1106,"d":"11-06"}},null,{"$f":"IF(ISBLANK(partije!M157),\"\",partije!M157)","v":{"v":1214,"d":"12-14"}},null,{"$f":"IF(ISBLANK(partije!N157),\"\",partije!N157)","v":{"v":1012,"d":"10-12"}},{"$f":"IF(ISBLANK(partije!M157),\"\",partije!M157)","v":{"v":1214,"d":"12-14"}},{"$f":"IF(ISBLANK(partije!O157),\"\",partije!O157)","v":{"v":1105,"d":"11-05"}},{"$f":"IF(ISBLANK(partije!P157),\"\",partije!P157)","v":{"v":1108,"d":"11-08"}},{"$f":"IF(ISBLANK(partije!Q157),\"\",partije!Q157)","v":""},{"$f":"IF(ISBLANK(partije!R157),\"\",partije!R157)","v":""},{"$f":"IF(ISBLANK(partije!$D$157),\"\",partije!$D$157)","v":""},{"$f":"IF(ISBLANK(partije!$E$157),\"\",\"sto \"&partije!$E$157)","v":""},{"$f":"$S$15","v":2},{"$f":"$T$15","v":3}]
[]
[{"$nulls":3},"grupa 13"]
[null,"br.",null,"igrač",1,null,2,null,3,null,4,null,"pobede","porazi","mesto",null,"plasman grupe 13"]
[1,{"v":131,"d":"13-1"},{"$f":"IF(ISNA(MATCH(B173,spisak!$F$4:$F$308,0)),\"\",INDEX(spisak!$C$4:$C$308,MATCH(B173,spisak!$F$4:$F$308,0)))","v":"Vojvodina  Novi Sad"},{"$f":"IF(ISNA(MATCH(B173,spisak!$F$4:$F$308,0)),\"bye\",INDEX(spisak!$B$4:$B$308,MATCH(B173,spisak!$F$4:$F$308,0)))","v":"Miljuš Luka"},null,null,{"$f":"INDEX(E178:E183,MATCH(D173&D174,C178:C183&D178:D183,0))&\"/\"&INDEX(F178:F183,MATCH(D173&D174,C178:C183&D178:D183,0))","v":"3/1"},null,{"$f":"INDEX(E178:E183,MATCH(D173&D175,C178:C183&D178:D183,0))&\"/\"&INDEX(F178:F183,MATCH(D173&D175,C178:C183&D178:D183,0))","v":"3/0"},null,{"$f":"INDEX(E178:E183,MATCH(D173&D176,C178:C183&D178:D183,0))&\"/\"&INDEX(F178:F183,MATCH(D173&D176,C178:C183&D178:D183,0))","v":"/"},null,{"$f":"IF(ISBLANK(partije!$J$2),\"\",COUNTIFS(C178:C183,D173,E178:E183,3)+COUNTIFS(D178:D183,D173,F178:F183,3))","v":2},{"$f":"IF(ISBLANK(partije!$J$2),\"\",COUNTIFS(C178:C183,D173,E178:E183,\"<3\")+COUNTIFS(D178:D183,D173,F178:F183,\"<3\"))","v":0},1,1,{"$f":"IF(ISBLANK(D173),\"*\",INDEX(D173:D176,MATCH(P173,O173:O176,0)))","v":"Miljuš Luka"}]
[2,{"v":132,"d":"13-2"},{"$f":"IF(ISNA(MATCH(B174,spisak!$F$4:$F$308,0)),\"\",INDEX(spisak!$C$4:$C$308,MATCH(B174,spisak!$F$4:$F$308,0)))","v":"Hajduk Veljko"},{"$f":"IF(ISNA(MATCH(B174,spisak!$F$4:$F$308,0)),\"bye\",INDEX(spisak!$B$4:$B$308,MATCH(B174,spisak!$F$4:$F$308,0)))","v":"Pucarević Pavle"},{"$f":"INDEX(F178:F183,MATCH(D173&D174,C178:C183&D178:D183,0))&\"/\"&INDEX(E178:E183,MATCH(D173&D174,C178:C183&D178:D183,0))","v":"1/3"},{"$nulls":3},{"$f":"INDEX(E178:E183,MATCH(D174&D175,C178:C183&D178:D183,0))&\"/\"&INDEX(F178:F183,MATCH(D174&D175,C178:C183&D178:D183,0))","v":"3/0"},null,{"$f":"INDEX(E178:E183,MATCH(D174&D176,C178:C183&D178:D183,0))&\"/\"&INDEX(F178:F183,MATCH(D174&D176,C178:C183&D178:D183,0))","v":"/"},null,{"$f":"IF(ISBLANK(partije!$J$2),\"\",COUNTIFS(C178:C183,D174,E178:E183,3)+COUNTIFS(D178:D183,D174,F178:F183,3))","v":1},{"$f":"IF(ISBLANK(partije!$J$2),\"\",COUNTIFS(C178:C183,D174,E178:E183,\"<3\")+COUNTIFS(D178:D183,D174,F178:F183,\"<3\"))","v":1},2,2,{"$f":"IF(ISBLANK(D174),\"*\",INDEX(D173:D176,MATCH(P174,O173:O176,0)))","v":"Pucarević Pavle"}]
[3,{"v":133,"d":"13-3"},{"$f":"IF(ISNA(MATCH(B175,spisak!$F$4:$F$308,0)),\"\",INDEX(spisak!$C$4:$C$308,MATCH(B175,spisak!$F$4:$F$308,0)))","v":"Železničar Niš"},{"$f":"IF(ISNA(MATCH(B175,spisak!$F$4:$F$308,0)),\"bye\",INDEX(spisak!$B$4:$B$308,MATCH(B175,spisak!$F$4:$F$308,0)))","v":"Stojilković Aleksej"},{"$f":"INDEX(F178:F183,MATCH(D173&D175,C178:C183&D178:D183,0))&\"/\"&INDEX(E178:E183,MATCH(D173&D175,C178:C183&D178:D183,0))","v":"0/3"},null,{"$f":"INDEX(F178:F183,MATCH(D174&D175,C178:C183&D178:D183,0))&\"/\"&INDEX(E178:E183,MATCH(D174&D175,C178:C183&D178:D183,0))","v":"0/3"},{"$nulls":3},{"$f":"INDEX(E178:E183,MATCH(D175&D176,C178:C183&D178:D183,0))&\"/\"&INDEX(F178:F183,MATCH(D175&D176,C178:C183&D178:D183,0))","v":"/"},null,{"$f":"IF(ISBLANK(partije!$J$2),\"\",COUNTIFS(C178:C183,D175,E178:E183,3)+COUNTIFS(D178:D183,D175,F178:F183,3))","v":0},{"$f":"IF(ISBLANK(partije!$J$2),\"\",COUNTIFS(C178:C183,D175,E178:E183,\"<3\")+COUNTIFS(D178:D183,D175,F178:F183,\"<3\"))","v":2},3,3,{"$f":"IF(ISBLANK(D175),\"*\",INDEX(D173:D176,MATCH(P175,O173:O176,0)))","v":"Stojilković Aleksej"}]
[4,{"v":134,"d":"13-4"},{"$f":"IF(ISNA(MATCH(B176,spisak!$F$4:$F$308,0)),\"\",INDEX(spisak!$C$4:$C$308,MATCH(B176,spisak!$F$4:$F$308,0)))","v":""},{"$f":"IF(ISNA(MATCH(B176,spisak!$F$4:$F$308,0)),\"bye\",INDEX(spisak!$B$4:$B$308,MATCH(B176,spisak!$F$4:$F$308,0)))","v":"bye"},{"$f":"INDEX(F178:F183,MATCH(D173&D176,C178:C183&D178:D183,0))&\"/\"&INDEX(E178:E183,MATCH(D173&D176,C178:C183&D178:D183,0))","v":"/"},null,{"$f":"INDEX(F178:F183,MATCH(D174&D176,C178:C183&D178:D183,0))&\"/\"&INDEX(E178:E183,MATCH(D174&D176,C178:C183&D178:D183,0))","v":"/"},null,{"$f":"INDEX(F178:F183,MATCH(D175&D176,C178:C183&D178:D183,0))&\"/\"&INDEX(E178:E183,MATCH(D175&D176,C178:C183&D178:D183,0))","v":"/"},{"$nulls":3},{"$f":"IF(ISBLANK(partije!$J$2),\"\",COUNTIFS(C178:C183,D176,E178:E183,3)+COUNTIFS(D178:D183,D176,F178:F183,3))","v":0},{"$f":"IF(ISBLANK(partije!$J$2),\"\",COUNTIFS(C178:C183,D176,E178:E183,\"<3\")+COUNTIFS(D178:D183,D176,F178:F183,\"<3\"))","v":0},null,4,{"$f":"IF(ISBLANK(D176),\"*\",INDEX(D173:D176,MATCH(P176,O173:O176,0)))","v":{"$error":"#N/A"}}]
[{"$nulls":4},"rezultat",null,"set1",null,"set 2",null,"set 3",null,"set 4","set 5","set 6","set 7",null,null,"berger4"]
[{"$f":"IF(ISBLANK(partije!D26),\"\",partije!D26)","v":""},{"$f":"IF(ISBLANK(partije!E26),\"\",partije!E26)","v":""},{"$f":"INDEX(D173:D176,MATCH(S178,A173:A176,0))","v":"Miljuš Luka"},{"$f":"INDEX(D173:D176,MATCH(T178,A173:A176,0))","v":"Stojilković Aleksej"},{"$f":"IF(ISBLANK(partije!J26),\"\",partije!J26)","v":3},{"$f":"IF(ISBLANK(partije!K26),\"\",partije!K26)","v":0},{"$f":"IF(ISBLANK(partije!L26),\"\",partije!L26)","v":{"v":1102,"d":"11-02"}},null,{"$f":"IF(ISBLANK(partije!M26),\"\",partije!M26)","v":{"v":1107,"d":"11-07"}},null,{"$f":"IF(ISBLANK(partije!N26),\"\",partije!N26)","v":{"v":1103,"d":"11-03"}},{"$f":"IF(ISBLANK(partije!M26),\"\",partije!M26)","v":{"v":1107,"d":"11-07"}},{"$f":"IF(ISBLANK(partije!O26),\"\",partije!O26)","v":""},{"$f":"IF(ISBLANK(partije!P26),\"\",partije!P26)","v":""},{"$f":"IF(ISBLANK(partije!Q26),\"\",partije!Q26)","v":""},{"$f":"IF(ISBLANK(partije!R26),\"\",partije!R26)","v":""},{"$f":"IF(ISBLANK(partije!$D$26),\"\",partije!$D$26)","v":""},{"$f":"IF(ISBLANK(partije!$E$26),\"\",\"sto \"&partije!$E$26)","v":""},{"$f":"$S$10","v":1},{"$f":"$T$10","v":3}]
[{"$f":"IF(ISBLANK(partije!D27),\"\",partije!D27)","v":""},{"$f":"IF(ISBLANK(partije!E27),\"\",partije!E27)","v":""},{"$f":"INDEX(D173:D176,MATCH(S179,A173:A176,0))","v":"Pucarević Pavle"},{"$f":"INDEX(D173:D176,MATCH(T179,A173:A176,0))","v":"bye"},{"$f":"IF(ISBLANK(partije!J27),\"\",partije!J27)","v":""},{"$f":"IF(ISBLANK(partije!K27),\"\",partije!K27)","v":""},{"$f":"IF(ISBLANK(partije!L27),\"\",partije!L27)","v":""},null,{"$f":"IF(ISBLANK(partije!M27),\"\",partije!M27)","v":""},null,{"$f":"IF(ISBLANK(partije!N27),\"\",partije!N27)","v":""},{"$f":"IF(ISBLANK(partije!M27),\"\",partije!M27)","v":""},{"$f":"IF(ISBLANK(partije!O27),\"\",partije!O27)","v":""},{"$f":"IF(ISBLANK(partije!P27),\"\",partije!P27)","v":""},{"$f":"IF(ISBLANK(partije!Q27),\"\",partije!Q27)","v":""},{"$f":"IF(ISBLANK(partije!R27),\"\",partije!R27)","v":""},{"$f":"IF(ISBLANK(partije!$D$27),\"\",partije!$D$27)","v":""},{"$f":"IF(ISBLANK(partije!$E$27),\"\",\"sto \"&partije!$E$27)","v":""},{"$f":"$S$11","v":2},{"$f":"$T$11","v":4}]
[{"$f":"IF(ISBLANK(partije!D92),\"\",partije!D92)","v":""},{"$f":"IF(ISBLANK(partije!E92),\"\",partije!E92)","v":""},{"$f":"INDEX(D173:D176,MATCH(S180,A173:A176,0))","v":"Miljuš Luka"},{"$f":"INDEX(D173:D176,MATCH(T180,A173:A176,0))","v":"Pucarević Pavle"},{"$f":"IF(ISBLANK(partije!J92),\"\",partije!J92)","v":3},{"$f":"IF(ISBLANK(partije!K92),\"\",partije!K92)","v":1},{"$f":"IF(ISBLANK(partije!L92),\"\",partije!L92)","v":{"v":1105,"d":"11-05"}},null,{"$f":"IF(ISBLANK(partije!M92),\"\",partije!M92)","v":{"v":611,"d":"06-11"}},null,{"$f":"IF(ISBLANK(partije!N92),\"\",partije!N92)","v":{"v":1109,"d":"11-09"}},{"$f":"IF(ISBLANK(partije!M92),\"\",partije!M92)","v":{"v":611,"d":"06-11"}},{"$f":"IF(ISBLANK(partije!O92),\"\",partije!O92)","v":{"v":1109,"d":"11-09"}},{"$f":"IF(ISBLANK(partije!P92),\"\",partije!P92)","v":""},{"$f":"IF(ISBLANK(partije!Q92),\"\",partije!Q92)","v":""},{"$f":"IF(ISBLANK(partije!R92),\"\",partije!R92)","v":""},{"$f":"IF(ISBLANK(partije!$D$92),\"\",partije!$D$92)","v":""},{"$f":"IF(ISBLANK(partije!$E$92),\"\",\"sto \"&partije!$E$92)","v":""},{"$f":"$S$12","v":1},{"$f":"$T$12","v":2}]
[{"$f":"IF(ISBLANK(partije!D93),\"\",partije!D93)","v":""},{"$f":"IF(ISBLANK(partije!E93),\"\",partije!E93)","v":""},{"$f":"INDEX(D173:D176,MATCH(S181,A173:A176,0))","v":"Stojilković Aleksej"},{"$f":"INDEX(D173:D176,MATCH(T181,A173:A176,0))","v":"bye"},{"$f":"IF(ISBLANK(partije!J93),\"\",partije!J93)","v":""},{"$f":"IF(ISBLANK(partije!K93),\"\",partije!K93)","v":""},{"$f":"IF(ISBLANK(partije!L93),\"\",partije!L93)","v":""},null,{"$f":"IF(ISBLANK(partije!M93),\"\",partije!M93)","v":""},null,{"$f":"IF(ISBLANK(partije!N93),\"\",partije!N93)","v":""},{"$f":"IF(ISBLANK(partije!M93),\"\",partije!M93)","v":""},{"$f":"IF(ISBLANK(partije!O93),\"\",partije!O93)","v":""},{"$f":"IF(ISBLANK(partije!P93),\"\",partije!P93)","v":""},{"$f":"IF(ISBLANK(partije!Q93),\"\",partije!Q93)","v":""},{"$f":"IF(ISBLANK(partije!R93),\"\",partije!R93)","v":""},{"$f":"IF(ISBLANK(partije!$D$93),\"\",partije!$D$93)","v":""},{"$f":"IF(ISBLANK(partije!$E$93),\"\",\"sto \"&partije!$E$93)","v":""},{"$f":"$S$13","v":3},{"$f":"$T$13","v":4}]
[{"$f":"IF(ISBLANK(partije!D158),\"\",partije!D158)","v":""},{"$f":"IF(ISBLANK(partije!E158),\"\",partije!E158)","v":""},{"$f":"INDEX(D173:D176,MATCH(S182,A173:A176,0))","v":"Miljuš Luka"},{"$f":"INDEX(D173:D176,MATCH(T182,A173:A176,0))","v":"bye"},{"$f":"IF(ISBLANK(partije!J158),\"\",partije!J158)","v":""},{"$f":"IF(ISBLANK(partije!K158),\"\",partije!K158)","v":""},{"$f":"IF(ISBLANK(partije!L158),\"\",partije!L158)","v":""},null,{"$f":"IF(ISBLANK(partije!M158),\"\",partije!M158)","v":""},null,{"$f":"IF(ISBLANK(partije!N158),\"\",partije!N158)","v":""},{"$f":"IF(ISBLANK(partije!M158),\"\",partije!M158)","v":""},{"$f":"IF(ISBLANK(partije!O158),\"\",partije!O158)","v":""},{"$f":"IF(ISBLANK(partije!P158),\"\",partije!P158)","v":""},{"$f":"IF(ISBLANK(partije!Q158),\"\",partije!Q158)","v":""},{"$f":"IF(ISBLANK(partije!R158),\"\",partije!R158)","v":""},{"$f":"IF(ISBLANK(partije!$D$158),\"\",partije!$D$158)","v":""},{"$f":"IF(ISBLANK(partije!$E$158),\"\",\"sto \"&partije!$E$158)","v":""},{"$f":"$S$14","v":1},{"$f":"$T$14","v":4}]
[{"$f":"IF(ISBLANK(partije!D159),\"\",partije!D159)","v":""},{"$f":"IF(ISBLANK(partije!E159),\"\",partije!E159)","v":""},{"$f":"INDEX(D173:D176,MATCH(S183,A173:A176,0))","v":"Pucarević Pavle"},{"$f":"INDEX(D173:D176,MATCH(T183,A173:A176,0))","v":"Stojilković Aleksej"},{"$f":"IF(ISBLANK(partije!J159),\"\",partije!J159)","v":3},{"$f":"IF(ISBLANK(partije!K159),\"\",partije!K159)","v":0},{"$f":"IF(ISBLANK(partije!L159),\"\",partije!L159)","v":{"v":1103,"d":"11-03"}},null,{"$f":"IF(ISBLANK(partije!M159),\"\",partije!M159)","v":{"v":1104,"d":"11-04"}},null,{"$f":"IF(ISBLANK(partije!N159),\"\",partije!N159)","v":{"v":1106,"d":"11-06"}},{"$f":"IF(ISBLANK(partije!M159),\"\",partije!M159)","v":{"v":1104,"d":"11-04"}},{"$f":"IF(ISBLANK(partije!O159),\"\",partije!O159)","v":""},{"$f":"IF(ISBLANK(partije!P159),\"\",partije!P159)","v":""},{"$f":"IF(ISBLANK(partije!Q159),\"\",partije!Q159)","v":""},{"$f":"IF(ISBLANK(partije!R159),\"\",partije!R159)","v":""},{"$f":"IF(ISBLANK(partije!$D$159),\"\",partije!$D$159)","v":""},{"$f":"IF(ISBLANK(partije!$E$159),\"\",\"sto \"&partije!$E$159)","v":""},{"$f":"$S$15","v":2},{"$f":"$T$15","v":3}]
[]
[{"$nulls":3},"grupa 14"]
[null,"br.",null,"igrač",1,null,2,null,3,null,4,null,"pobede","porazi","mesto",null,"plasman grupe 14"]
[1,{"v":141,"d":"14-1"},{"$f":"IF(ISNA(MATCH(B187,spisak!$F$4:$F$308,0)),\"\",INDEX(spisak!$C$4:$C$308,MATCH(B187,spisak!$F$4:$F$308,0)))","v":"Novi Sad"},{"$f":"IF(ISNA(MATCH(B187,spisak!$F$4:$F$308,0)),\"bye\",INDEX(spisak!$B$4:$B$308,MATCH(B187,spisak!$F$4:$F$308,0)))","v":"Gerginov Vanja"},null,null,{"$f":"INDEX(E192:E197,MATCH(D187&D188,C192:C197&D192:D197,0))&\"/\"&INDEX(F192:F197,MATCH(D187&D188,C192:C197&D192:D197,0))","v":"3/0"},null,{"$f":"INDEX(E192:E197,MATCH(D187&D189,C192:C197&D192:D197,0))&\"/\"&INDEX(F192:F197,MATCH(D187&D189,C192:C197&D192:D197,0))","v":"3/1"},null,{"$f":"INDEX(E192:E197,MATCH(D187&D190,C192:C197&D192:D197,0))&\"/\"&INDEX(F192:F197,MATCH(D187&D190,C192:C197&D192:D197,0))","v":"/"},null,{"$f":"IF(ISBLANK(partije!$J$2),\"\",COUNTIFS(C192:C197,D187,E192:E197,3)+COUNTIFS(D192:D197,D187,F192:F197,3))","v":2},{"$f":"IF(ISBLANK(partije!$J$2),\"\",COUNTIFS(C192:C197,D187,E192:E197,\"<3\")+COUNTIFS(D192:D197,D187,F192:F197,\"<3\"))","v":0},1,1,{"$f":"IF(ISBLANK(D187),\"*\",INDEX(D187:D190,MATCH(P187,O187:O190,0)))","v":"Gerginov Vanja"}]
[2,{"v":142,"d":"14-2"},{"$f":"IF(ISNA(MATCH(B188,spisak!$F$4:$F$308,0)),\"\",INDEX(spisak!$C$4:$C$308,MATCH(B188,spisak!$F$4:$F$308,0)))","v":"Rusin"},{"$f":"IF(ISNA(MATCH(B188,spisak!$F$4:$F$308,0)),\"bye\",INDEX(spisak!$B$4:$B$308,MATCH(B188,spisak!$F$4:$F$308,0)))","v":"Sabadoš Matej"},{"$f":"INDEX(F192:F197,MATCH(D187&D188,C192:C197&D192:D197,0))&\"/\"&INDEX(E192:E197,MATCH(D187&D188,C192:C197&D192:D197,0))","v":"0/3"},{"$nulls":3},{"$f":"INDEX(E192:E197,MATCH(D188&D189,C192:C197&D192:D197,0))&\"/\"&INDEX(F192:F197,MATCH(D188&D189,C192:C197&D192:D197,0))","v":"0/3"},null,{"$f":"INDEX(E192:E197,MATCH(D188&D190,C192:C197&D192:D197,0))&\"/\"&INDEX(F192:F197,MATCH(D188&D190,C192:C197&D192:D197,0))","v":"/"},null,{"$f":"IF(ISBLANK(partije!$J$2),\"\",COUNTIFS(C192:C197,D188,E192:E197,3)+COUNTIFS(D192:D197,D188,F192:F197,3))","v":0},{"$f":"IF(ISBLANK(partije!$J$2),\"\",COUNTIFS(C192:C197,D188,E192:E197,\"<3\")+COUNTIFS(D192:D197,D188,F192:F197,\"<3\"))","v":2},3,2,{"$f":"IF(ISBLANK(D188),\"*\",INDEX(D187:D190,MATCH(P188,O187:O190,0)))","v":"Pavković Đorđe"}]
[3,{"v":143,"d":"14-3"},{"$f":"IF(ISNA(MATCH(B189,spisak!$F$4:$F$308,0)),\"\",INDEX(spisak!$C$4:$C$308,MATCH(B189,spisak!$F$4:$F$308,0)))","v":"Ozren Sokobanja"},{"$f":"IF(ISNA(MATCH(B189,spisak!$F$4:$F$308,0)),\"bye\",INDEX(spisak!$B$4:$B$308,MATCH(B189,spisak!$F$4:$F$308,0)))","v":"Pavković Đorđe"},{"$f":"INDEX(F192:F197,MATCH(D187&D189,C192:C197&D192:D197,0))&\"/\"&INDEX(E192:E197,MATCH(D187&D189,C192:C197&D192:D197,0))","v":"1/3"},null,{"$f":"INDEX(F192:F197,MATCH(D188&D189,C192:C197&D192:D197,0))&\"/\"&INDEX(E192:E197,MATCH(D188&D189,C192:C197&D192:D197,0))","v":"3/0"},{"$nulls":3},{"$f":"INDEX(E192:E197,MATCH(D189&D190,C192:C197&D192:D197,0))&\"/\"&INDEX(F192:F197,MATCH(D189&D190,C192:C197&D192:D197,0))","v":"/"},null,{"$f":"IF(ISBLANK(partije!$J$2),\"\",COUNTIFS(C192:C197,D189,E192:E197,3)+COUNTIFS(D192:D197,D189,F192:F197,3))","v":1},{"$f":"IF(ISBLANK(partije!$J$2),\"\",COUNTIFS(C192:C197,D189,E192:E197,\"<3\")+COUNTIFS(D192:D197,D189,F192:F197,\"<3\"))","v":1},2,3,{"$f":"IF(ISBLANK(D189),\"*\",INDEX(D187:D190,MATCH(P189,O187:O190,0)))","v":"Sabadoš Matej"}]
[4,{"v":144,"d":"14-4"},{"$f":"IF(ISNA(MATCH(B190,spisak!$F$4:$F$308,0)),\"\",INDEX(spisak!$C$4:$C$308,MATCH(B190,spisak!$F$4:$F$308,0)))","v":""},{"$f":"IF(ISNA(MATCH(B190,spisak!$F$4:$F$308,0)),\"bye\",INDEX(spisak!$B$4:$B$308,MATCH(B190,spisak!$F$4:$F$308,0)))","v":"bye"},{"$f":"INDEX(F192:F197,MATCH(D187&D190,C192:C197&D192:D197,0))&\"/\"&INDEX(E192:E197,MATCH(D187&D190,C192:C197&D192:D197,0))","v":"/"},null,{"$f":"INDEX(F192:F197,MATCH(D188&D190,C192:C197&D192:D197,0))&\"/\"&INDEX(E192:E197,MATCH(D188&D190,C192:C197&D192:D197,0))","v":"/"},null,{"$f":"INDEX(F192:F197,MATCH(D189&D190,C192:C197&D192:D197,0))&\"/\"&INDEX(E192:E197,MATCH(D189&D190,C192:C197&D192:D197,0))","v":"/"},{"$nulls":3},{"$f":"IF(ISBLANK(partije!$J$2),\"\",COUNTIFS(C192:C197,D190,E192:E197,3)+COUNTIFS(D192:D197,D190,F192:F197,3))","v":0},{"$f":"IF(ISBLANK(partije!$J$2),\"\",COUNTIFS(C192:C197,D190,E192:E197,\"<3\")+COUNTIFS(D192:D197,D190,F192:F197,\"<3\"))","v":0},null,4,{"$f":"IF(ISBLANK(D190),\"*\",INDEX(D187:D190,MATCH(P190,O187:O190,0)))","v":{"$error":"#N/A"}}]
[{"$nulls":4},"rezultat",null,"set1",null,"set 2",null,"set 3",null,"set 4","set 5","set 6","set 7",null,null,"berger4"]
[{"$f":"IF(ISBLANK(partije!D28),\"\",partije!D28)","v":""},{"$f":"IF(ISBLANK(partije!E28),\"\",partije!E28)","v":""},{"$f":"INDEX(D187:D190,MATCH(S192,A187:A190,0))","v":"Gerginov Vanja"},{"$f":"INDEX(D187:D190,MATCH(T192,A187:A190,0))","v":"Pavković Đorđe"},{"$f":"IF(ISBLANK(partije!J28),\"\",partije!J28)","v":3},{"$f":"IF(ISBLANK(partije!K28),\"\",partije!K28)","v":1},{"$f":"IF(ISBLANK(partije!L28),\"\",partije!L28)","v":{"v":1108,"d":"11-08"}},null,{"$f":"IF(ISBLANK(partije!M28),\"\",partije!M28)","v":{"v":1107,"d":"11-07"}},null,{"$f":"IF(ISBLANK(partije!N28),\"\",partije!N28)","v":{"v":1012,"d":"10-12"}},{"$f":"IF(ISBLANK(partije!M28),\"\",partije!M28)","v":{"v":1107,"d":"11-07"}},{"$f":"IF(ISBLANK(partije!O28),\"\",partije!O28)","v":{"v":1108,"d":"11-08"}},{"$f":"IF(ISBLANK(partije!P28),\"\",partije!P28)","v":""},{"$f":"IF(ISBLANK(partije!Q28),\"\",partije!Q28)","v":""},{"$f":"IF(ISBLANK(partije!R28),\"\",partije!R28)","v":""},{"$f":"IF(ISBLANK(partije!$D$28),\"\",partije!$D$28)","v":""},{"$f":"IF(ISBLANK(partije!$E$28),\"\",\"sto \"&partije!$E$28)","v":""},{"$f":"$S$10","v":1},{"$f":"$T$10","v":3}]
[{"$f":"IF(ISBLANK(partije!D29),\"\",partije!D29)","v":""},{"$f":"IF(ISBLANK(partije!E29),\"\",partije!E29)","v":""},{"$f":"INDEX(D187:D190,MATCH(S193,A187:A190,0))","v":"Sabadoš Matej"},{"$f":"INDEX(D187:D190,MATCH(T193,A187:A190,0))","v":"bye"},{"$f":"IF(ISBLANK(partije!J29),\"\",partije!J29)","v":""},{"$f":"IF(ISBLANK(partije!K29),\"\",partije!K29)","v":""},{"$f":"IF(ISBLANK(partije!L29),\"\",partije!L29)","v":""},null,{"$f":"IF(ISBLANK(partije!M29),\"\",partije!M29)","v":""},null,{"$f":"IF(ISBLANK(partije!N29),\"\",partije!N29)","v":""},{"$f":"IF(ISBLANK(partije!M29),\"\",partije!M29)","v":""},{"$f":"IF(ISBLANK(partije!O29),\"\",partije!O29)","v":""},{"$f":"IF(ISBLANK(partije!P29),\"\",partije!P29)","v":""},{"$f":"IF(ISBLANK(partije!Q29),\"\",partije!Q29)","v":""},{"$f":"IF(ISBLANK(partije!R29),\"\",partije!R29)","v":""},{"$f":"IF(ISBLANK(partije!$D$29),\"\",partije!$D$29)","v":""},{"$f":"IF(ISBLANK(partije!$E$29),\"\",\"sto \"&partije!$E$29)","v":""},{"$f":"$S$11","v":2},{"$f":"$T$11","v":4}]
[{"$f":"IF(ISBLANK(partije!D94),\"\",partije!D94)","v":""},{"$f":"IF(ISBLANK(partije!E94),\"\",partije!E94)","v":""},{"$f":"INDEX(D187:D190,MATCH(S194,A187:A190,0))","v":"Gerginov Vanja"},{"$f":"INDEX(D187:D190,MATCH(T194,A187:A190,0))","v":"Sabadoš Matej"},{"$f":"IF(ISBLANK(partije!J94),\"\",partije!J94)","v":3},{"$f":"IF(ISBLANK(partije!K94),\"\",partije!K94)","v":0},{"$f":"IF(ISBLANK(partije!L94),\"\",partije!L94)","v":{"v":1412,"d":"14-12"}},null,{"$f":"IF(ISBLANK(partije!M94),\"\",partije!M94)","v":{"v":1109,"d":"11-09"}},null,{"$f":"IF(ISBLANK(partije!N94),\"\",partije!N94)","v":{"v":1109,"d":"11-09"}},{"$f":"IF(ISBLANK(partije!M94),\"\",partije!M94)","v":{"v":1109,"d":"11-09"}},{"$f":"IF(ISBLANK(partije!O94),\"\",partije!O94)","v":""},{"$f":"IF(ISBLANK(partije!P94),\"\",partije!P94)","v":""},{"$f":"IF(ISBLANK(partije!Q94),\"\",partije!Q94)","v":""},{"$f":"IF(ISBLANK(partije!R94),\"\",partije!R94)","v":""},{"$f":"IF(ISBLANK(partije!$D$94),\"\",partije!$D$94)","v":""},{"$f":"IF(ISBLANK(partije!$E$94),\"\",\"sto \"&partije!$E$94)","v":""},{"$f":"$S$12","v":1},{"$f":"$T$12","v":2}]
[{"$f":"IF(ISBLANK(partije!D95),\"\",partije!D95)","v":""},{"$f":"IF(ISBLANK(partije!E95),\"\",partije!E95)","v":""},{"$f":"INDEX(D187:D190,MATCH(S195,A187:A190,0))","v":"Pavković Đorđe"},{"$f":"INDEX(D187:D190,MATCH(T195,A187:A190,0))","v":"bye"},{"$f":"IF(ISBLANK(partije!J95),\"\",partije!J95)","v":""},{"$f":"IF(ISBLANK(partije!K95),\"\",partije!K95)","v":""},{"$f":"IF(ISBLANK(partije!L95),\"\",partije!L95)","v":""},null,{"$f":"IF(ISBLANK(partije!M95),\"\",partije!M95)","v":""},null,{"$f":"IF(ISBLANK(partije!N95),\"\",partije!N95)","v":""},{"$f":"IF(ISBLANK(partije!M95),\"\",partije!M95)","v":""},{"$f":"IF(ISBLANK(partije!O95),\"\",partije!O95)","v":""},{"$f":"IF(ISBLANK(partije!P95),\"\",partije!P95)","v":""},{"$f":"IF(ISBLANK(partije!Q95),\"\",partije!Q95)","v":""},{"$f":"IF(ISBLANK(partije!R95),\"\",partije!R95)","v":""},{"$f":"IF(ISBLANK(partije!$D$95),\"\",partije!$D$95)","v":""},{"$f":"IF(ISBLANK(partije!$E$95),\"\",\"sto \"&partije!$E$95)","v":""},{"$f":"$S$13","v":3},{"$f":"$T$13","v":4}]
[{"$f":"IF(ISBLANK(partije!D160),\"\",partije!D160)","v":""},{"$f":"IF(ISBLANK(partije!E160),\"\",partije!E160)","v":""},{"$f":"INDEX(D187:D190,MATCH(S196,A187:A190,0))","v":"Gerginov Vanja"},{"$f":"INDEX(D187:D190,MATCH(T196,A187:A190,0))","v":"bye"},{"$f":"IF(ISBLANK(partije!J160),\"\",partije!J160)","v":""},{"$f":"IF(ISBLANK(partije!K160),\"\",partije!K160)","v":""},{"$f":"IF(ISBLANK(partije!L160),\"\",partije!L160)","v":""},null,{"$f":"IF(ISBLANK(partije!M160),\"\",partije!M160)","v":""},null,{"$f":"IF(ISBLANK(partije!N160),\"\",partije!N160)","v":""},{"$f":"IF(ISBLANK(partije!M160),\"\",partije!M160)","v":""},{"$f":"IF(ISBLANK(partije!O160),\"\",partije!O160)","v":""},{"$f":"IF(ISBLANK(partije!P160),\"\",partije!P160)","v":""},{"$f":"IF(ISBLANK(partije!Q160),\"\",partije!Q160)","v":""},{"$f":"IF(ISBLANK(partije!R160),\"\",partije!R160)","v":""},{"$f":"IF(ISBLANK(partije!$D$160),\"\",partije!$D$160)","v":""},{"$f":"IF(ISBLANK(partije!$E$160),\"\",\"sto \"&partije!$E$160)","v":""},{"$f":"$S$14","v":1},{"$f":"$T$14","v":4}]
[{"$f":"IF(ISBLANK(partije!D161),\"\",partije!D161)","v":""},{"$f":"IF(ISBLANK(partije!E161),\"\",partije!E161)","v":""},{"$f":"INDEX(D187:D190,MATCH(S197,A187:A190,0))","v":"Sabadoš Matej"},{"$f":"INDEX(D187:D190,MATCH(T197,A187:A190,0))","v":"Pavković Đorđe"},{"$f":"IF(ISBLANK(partije!J161),\"\",partije!J161)","v":0},{"$f":"IF(ISBLANK(partije!K161),\"\",partije!K161)","v":3},{"$f":"IF(ISBLANK(partije!L161),\"\",partije!L161)","v":{"v":911,"d":"09-11"}},null,{"$f":"IF(ISBLANK(partije!M161),\"\",partije!M161)","v":{"v":711,"d":"07-11"}},null,{"$f":"IF(ISBLANK(partije!N161),\"\",partije!N161)","v":{"v":711,"d":"07-11"}},{"$f":"IF(ISBLANK(partije!M161),\"\",partije!M161)","v":{"v":711,"d":"07-11"}},{"$f":"IF(ISBLANK(partije!O161),\"\",partije!O161)","v":""},{"$f":"IF(ISBLANK(partije!P161),\"\",partije!P161)","v":""},{"$f":"IF(ISBLANK(partije!Q161),\"\",partije!Q161)","v":""},{"$f":"IF(ISBLANK(partije!R161),\"\",partije!R161)","v":""},{"$f":"IF(ISBLANK(partije!$D$161),\"\",partije!$D$161)","v":""},{"$f":"IF(ISBLANK(partije!$E$161),\"\",\"sto \"&partije!$E$161)","v":""},{"$f":"$S$15","v":2},{"$f":"$T$15","v":3}]
[]
[{"$nulls":3},"grupa 15"]
[null,"br.",null,"igrač",1,null,2,null,3,null,4,null,"pobede","porazi","mesto",null,"plasman grupe 15"]
[1,{"v":151,"d":"15-1"},{"$f":"IF(ISNA(MATCH(B201,spisak!$F$4:$F$308,0)),\"\",INDEX(spisak!$C$4:$C$308,MATCH(B201,spisak!$F$4:$F$308,0)))","v":"Novi Sad"},{"$f":"IF(ISNA(MATCH(B201,spisak!$F$4:$F$308,0)),\"bye\",INDEX(spisak!$B$4:$B$308,MATCH(B201,spisak!$F$4:$F$308,0)))","v":"Rajić Dalibor"},null,null,{"$f":"INDEX(E206:E211,MATCH(D201&D202,C206:C211&D206:D211,0))&\"/\"&INDEX(F206:F211,MATCH(D201&D202,C206:C211&D206:D211,0))","v":"0/3"},null,{"$f":"INDEX(E206:E211,MATCH(D201&D203,C206:C211&D206:D211,0))&\"/\"&INDEX(F206:F211,MATCH(D201&D203,C206:C211&D206:D211,0))","v":"3/0"},null,{"$f":"INDEX(E206:E211,MATCH(D201&D204,C206:C211&D206:D211,0))&\"/\"&INDEX(F206:F211,MATCH(D201&D204,C206:C211&D206:D211,0))","v":"/"},null,{"$f":"IF(ISBLANK(partije!$J$2),\"\",COUNTIFS(C206:C211,D201,E206:E211,3)+COUNTIFS(D206:D211,D201,F206:F211,3))","v":1},{"$f":"IF(ISBLANK(partije!$J$2),\"\",COUNTIFS(C206:C211,D201,E206:E211,\"<3\")+COUNTIFS(D206:D211,D201,F206:F211,\"<3\"))","v":1},2,1,{"$f":"IF(ISBLANK(D201),\"*\",INDEX(D201:D204,MATCH(P201,O201:O204,0)))","v":"Paunović Petar"}]
[2,{"v":152,"d":"15-2"},{"$f":"IF(ISNA(MATCH(B202,spisak!$F$4:$F$308,0)),\"\",INDEX(spisak!$C$4:$C$308,MATCH(B202,spisak!$F$4:$F$308,0)))","v":"Stoni"},{"$f":"IF(ISNA(MATCH(B202,spisak!$F$4:$F$308,0)),\"bye\",INDEX(spisak!$B$4:$B$308,MATCH(B202,spisak!$F$4:$F$308,0)))","v":"Paunović Petar"},{"$f":"INDEX(F206:F211,MATCH(D201&D202,C206:C211&D206:D211,0))&\"/\"&INDEX(E206:E211,MATCH(D201&D202,C206:C211&D206:D211,0))","v":"3/0"},{"$nulls":3},{"$f":"INDEX(E206:E211,MATCH(D202&D203,C206:C211&D206:D211,0))&\"/\"&INDEX(F206:F211,MATCH(D202&D203,C206:C211&D206:D211,0))","v":"3/0"},null,{"$f":"INDEX(E206:E211,MATCH(D202&D204,C206:C211&D206:D211,0))&\"/\"&INDEX(F206:F211,MATCH(D202&D204,C206:C211&D206:D211,0))","v":"/"},null,{"$f":"IF(ISBLANK(partije!$J$2),\"\",COUNTIFS(C206:C211,D202,E206:E211,3)+COUNTIFS(D206:D211,D202,F206:F211,3))","v":2},{"$f":"IF(ISBLANK(partije!$J$2),\"\",COUNTIFS(C206:C211,D202,E206:E211,\"<3\")+COUNTIFS(D206:D211,D202,F206:F211,\"<3\"))","v":0},1,2,{"$f":"IF(ISBLANK(D202),\"*\",INDEX(D201:D204,MATCH(P202,O201:O204,0)))","v":"Rajić Dalibor"}]
[3,{"v":153,"d":"15-3"},{"$f":"IF(ISNA(MATCH(B203,spisak!$F$4:$F$308,0)),\"\",INDEX(spisak!$C$4:$C$308,MATCH(B203,spisak!$F$4:$F$308,0)))","v":"Bdinci Bugarska"},{"$f":"IF(ISNA(MATCH(B203,spisak!$F$4:$F$308,0)),\"bye\",INDEX(spisak!$B$4:$B$308,MATCH(B203,spisak!$F$4:$F$308,0)))","v":"Aleksandar Todorov"},{"$f":"INDEX(F206:F211,MATCH(D201&D203,C206:C211&D206:D211,0))&\"/\"&INDEX(E206:E211,MATCH(D201&D203,C206:C211&D206:D211,0))","v":"0/3"},null,{"$f":"INDEX(F206:F211,MATCH(D202&D203,C206:C211&D206:D211,0))&\"/\"&INDEX(E206:E211,MATCH(D202&D203,C206:C211&D206:D211,0))","v":"0/3"},{"$nulls":3},{"$f":"INDEX(E206:E211,MATCH(D203&D204,C206:C211&D206:D211,0))&\"/\"&INDEX(F206:F211,MATCH(D203&D204,C206:C211&D206:D211,0))","v":"/"},null,{"$f":"IF(ISBLANK(partije!$J$2),\"\",COUNTIFS(C206:C211,D203,E206:E211,3)+COUNTIFS(D206:D211,D203,F206:F211,3))","v":0},{"$f":"IF(ISBLANK(partije!$J$2),\"\",COUNTIFS(C206:C211,D203,E206:E211,\"<3\")+COUNTIFS(D206:D211,D203,F206:F211,\"<3\"))","v":2},3,3,{"$f":"IF(ISBLANK(D203),\"*\",INDEX(D201:D204,MATCH(P203,O201:O204,0)))","v":"Aleksandar Todorov"}]
[4,{"v":154,"d":"15-4"},{"$f":"IF(ISNA(MATCH(B204,spisak!$F$4:$F$308,0)),\"\",INDEX(spisak!$C$4:$C$308,MATCH(B204,spisak!$F$4:$F$308,0)))","v":""},{"$f":"IF(ISNA(MATCH(B204,spisak!$F$4:$F$308,0)),\"bye\",INDEX(spisak!$B$4:$B$308,MATCH(B204,spisak!$F$4:$F$308,0)))","v":"bye"},{"$f":"INDEX(F206:F211,MATCH(D201&D204,C206:C211&D206:D211,0))&\"/\"&INDEX(E206:E211,MATCH(D201&D204,C206:C211&D206:D211,0))","v":"/"},null,{"$f":"INDEX(F206:F211,MATCH(D202&D204,C206:C211&D206:D211,0))&\"/\"&INDEX(E206:E211,MATCH(D202&D204,C206:C211&D206:D211,0))","v":"/"},null,{"$f":"INDEX(F206:F211,MATCH(D203&D204,C206:C211&D206:D211,0))&\"/\"&INDEX(E206:E211,MATCH(D203&D204,C206:C211&D206:D211,0))","v":"/"},{"$nulls":3},{"$f":"IF(ISBLANK(partije!$J$2),\"\",COUNTIFS(C206:C211,D204,E206:E211,3)+COUNTIFS(D206:D211,D204,F206:F211,3))","v":0},{"$f":"IF(ISBLANK(partije!$J$2),\"\",COUNTIFS(C206:C211,D204,E206:E211,\"<3\")+COUNTIFS(D206:D211,D204,F206:F211,\"<3\"))","v":0},null,4,{"$f":"IF(ISBLANK(D204),\"*\",INDEX(D201:D204,MATCH(P204,O201:O204,0)))","v":{"$error":"#N/A"}}]
[{"$nulls":4},"rezultat",null,"set1",null,"set 2",null,"set 3",null,"set 4","set 5","set 6","set 7",null,null,"berger4"]
[{"$f":"IF(ISBLANK(partije!D30),\"\",partije!D30)","v":""},{"$f":"IF(ISBLANK(partije!E30),\"\",partije!E30)","v":""},{"$f":"INDEX(D201:D204,MATCH(S206,A201:A204,0))","v":"Rajić Dalibor"},{"$f":"INDEX(D201:D204,MATCH(T206,A201:A204,0))","v":"Aleksandar Todorov"},{"$f":"IF(ISBLANK(partije!J30),\"\",partije!J30)","v":3},{"$f":"IF(ISBLANK(partije!K30),\"\",partije!K30)","v":0},{"$f":"IF(ISBLANK(partije!L30),\"\",partije!L30)","v":{"v":1101,"d":"11-01"}},null,{"$f":"IF(ISBLANK(partije!M30),\"\",partije!M30)","v":{"v":1103,"d":"11-03"}},null,{"$f":"IF(ISBLANK(partije!N30),\"\",partije!N30)","v":{"v":1101,"d":"11-01"}},null,{"$f":"IF(ISBLANK(partije!O30),\"\",partije!O30)","v":""},{"$f":"IF(ISBLANK(partije!P30),\"\",partije!P30)","v":""},{"$f":"IF(ISBLANK(partije!Q30),\"\",partije!Q30)","v":""},{"$f":"IF(ISBLANK(partije!R30),\"\",partije!R30)","v":""},{"$f":"IF(ISBLANK(partije!$D$30),\"\",partije!$D$30)","v":""},{"$f":"IF(ISBLANK(partije!$E$30),\"\",\"sto \"&partije!$E$30)","v":""},{"$f":"$S$10","v":1},{"$f":"$T$10","v":3}]
[{"$f":"IF(ISBLANK(partije!D31),\"\",partije!D31)","v":""},{"$f":"IF(ISBLANK(partije!E31),\"\",partije!E31)","v":""},{"$f":"INDEX(D201:D204,MATCH(S207,A201:A204,0))","v":"Paunović Petar"},{"$f":"INDEX(D201:D204,MATCH(T207,A201:A204,0))","v":"bye"},{"$f":"IF(ISBLANK(partije!J31),\"\",partije!J31)","v":""},{"$f":"IF(ISBLANK(partije!K31),\"\",partije!K31)","v":""},{"$f":"IF(ISBLANK(partije!L31),\"\",partije!L31)","v":""},null,{"$f":"IF(ISBLANK(partije!M31),\"\",partije!M31)","v":""},null,{"$f":"IF(ISBLANK(partije!N31),\"\",partije!N31)","v":""},null,{"$f":"IF(ISBLANK(partije!O31),\"\",partije!O31)","v":""},{"$f":"IF(ISBLANK(partije!P31),\"\",partije!P31)","v":""},{"$f":"IF(ISBLANK(partije!Q31),\"\",partije!Q31)","v":""},{"$f":"IF(ISBLANK(partije!R31),\"\",partije!R31)","v":""},{"$f":"IF(ISBLANK(partije!$D$31),\"\",partije!$D$31)","v":""},{"$f":"IF(ISBLANK(partije!$E$31),\"\",\"sto \"&partije!$E$31)","v":""},{"$f":"$S$11","v":2},{"$f":"$T$11","v":4}]
[{"$f":"IF(ISBLANK(partije!D96),\"\",partije!D96)","v":""},{"$f":"IF(ISBLANK(partije!E96),\"\",partije!E96)","v":""},{"$f":"INDEX(D201:D204,MATCH(S208,A201:A204,0))","v":"Rajić Dalibor"},{"$f":"INDEX(D201:D204,MATCH(T208,A201:A204,0))","v":"Paunović Petar"},{"$f":"IF(ISBLANK(partije!J96),\"\",partije!J96)","v":0},{"$f":"IF(ISBLANK(partije!K96),\"\",partije!K96)","v":3},{"$f":"IF(ISBLANK(partije!L96),\"\",partije!L96)","v":{"v":911,"d":"09-11"}},null,{"$f":"IF(ISBLANK(partije!M96),\"\",partije!M96)","v":{"v":911,"d":"09-11"}},null,{"$f":"IF(ISBLANK(partije!N96),\"\",partije!N96)","v":{"v":1012,"d":"10-12"}},{"$f":"IF(ISBLANK(partije!M96),\"\",partije!M96)","v":{"v":911,"d":"09-11"}},{"$f":"IF(ISBLANK(partije!O96),\"\",partije!O96)","v":""},{"$f":"IF(ISBLANK(partije!P96),\"\",partije!P96)","v":""},{"$f":"IF(ISBLANK(partije!Q96),\"\",partije!Q96)","v":""},{"$f":"IF(ISBLANK(partije!R96),\"\",partije!R96)","v":""},{"$f":"IF(ISBLANK(partije!$D$96),\"\",partije!$D$96)","v":""},{"$f":"IF(ISBLANK(partije!$E$97),\"\",\"sto \"&partije!$E$97)","v":""},{"$f":"$S$12","v":1},{"$f":"$T$12","v":2}]
[{"$f":"IF(ISBLANK(partije!D97),\"\",partije!D97)","v":""},{"$f":"IF(ISBLANK(partije!E97),\"\",partije!E97)","v":""},{"$f":"INDEX(D201:D204,MATCH(S209,A201:A204,0))","v":"Aleksandar Todorov"},{"$f":"INDEX(D201:D204,MATCH(T209,A201:A204,0))","v":"bye"},{"$f":"IF(ISBLANK(partije!J97),\"\",partije!J97)","v":""},{"$f":"IF(ISBLANK(partije!K97),\"\",partije!K97)","v":""},{"$f":"IF(ISBLANK(partije!L97),\"\",partije!L97)","v":""},null,{"$f":"IF(ISBLANK(partije!M97),\"\",partije!M97)","v":""},null,{"$f":"IF(ISBLANK(partije!N97),\"\",partije!N97)","v":""},{"$f":"IF(ISBLANK(partije!M97),\"\",partije!M97)","v":""},{"$f":"IF(ISBLANK(partije!O97),\"\",partije!O97)","v":""},{"$f":"IF(ISBLANK(partije!P97),\"\",partije!P97)","v":""},{"$f":"IF(ISBLANK(partije!Q97),\"\",partije!Q97)","v":""},{"$f":"IF(ISBLANK(partije!R97),\"\",partije!R97)","v":""},{"$f":"IF(ISBLANK(partije!$D$97),\"\",partije!$D$97)","v":""},{"$f":"IF(ISBLANK(partije!$E$97),\"\",\"sto \"&partije!$E$97)","v":""},{"$f":"$S$13","v":3},{"$f":"$T$13","v":4}]
[{"$f":"IF(ISBLANK(partije!D162),\"\",partije!D162)","v":""},{"$f":"IF(ISBLANK(partije!E162),\"\",partije!E162)","v":""},{"$f":"INDEX(D201:D204,MATCH(S210,A201:A204,0))","v":"Rajić Dalibor"},{"$f":"INDEX(D201:D204,MATCH(T210,A201:A204,0))","v":"bye"},{"$f":"IF(ISBLANK(partije!J162),\"\",partije!J162)","v":""},{"$f":"IF(ISBLANK(partije!K162),\"\",partije!K162)","v":""},{"$f":"IF(ISBLANK(partije!L162),\"\",partije!L162)","v":""},null,{"$f":"IF(ISBLANK(partije!M162),\"\",partije!M162)","v":""},null,{"$f":"IF(ISBLANK(partije!N162),\"\",partije!N162)","v":""},{"$f":"IF(ISBLANK(partije!M162),\"\",partije!M162)","v":""},{"$f":"IF(ISBLANK(partije!O162),\"\",partije!O162)","v":""},{"$f":"IF(ISBLANK(partije!P162),\"\",partije!P162)","v":""},{"$f":"IF(ISBLANK(partije!Q162),\"\",partije!Q162)","v":""},{"$f":"IF(ISBLANK(partije!R162),\"\",partije!R162)","v":""},{"$f":"IF(ISBLANK(partije!$D$162),\"\",partije!$D$162)","v":""},{"$f":"IF(ISBLANK(partije!$E$162),\"\",\"sto \"&partije!$E$162)","v":""},{"$f":"$S$14","v":1},{"$f":"$T$14","v":4}]
[{"$f":"IF(ISBLANK(partije!D163),\"\",partije!D163)","v":""},{"$f":"IF(ISBLANK(partije!E163),\"\",partije!E163)","v":""},{"$f":"INDEX(D201:D204,MATCH(S211,A201:A204,0))","v":"Paunović Petar"},{"$f":"INDEX(D201:D204,MATCH(T211,A201:A204,0))","v":"Aleksandar Todorov"},{"$f":"IF(ISBLANK(partije!J163),\"\",partije!J163)","v":3},{"$f":"IF(ISBLANK(partije!K163),\"\",partije!K163)","v":0},{"$f":"IF(ISBLANK(partije!L163),\"\",partije!L163)","v":{"v":1102,"d":"11-02"}},null,{"$f":"IF(ISBLANK(partije!M163),\"\",partije!M163)","v":{"v":1104,"d":"11-04"}},null,{"$f":"IF(ISBLANK(partije!N163),\"\",partije!N163)","v":{"v":1106,"d":"11-06"}},{"$f":"IF(ISBLANK(partije!M163),\"\",partije!M163)","v":{"v":1104,"d":"11-04"}},{"$f":"IF(ISBLANK(partije!O163),\"\",partije!O163)","v":""},{"$f":"IF(ISBLANK(partije!P163),\"\",partije!P163)","v":""},{"$f":"IF(ISBLANK(partije!Q163),\"\",partije!Q163)","v":""},{"$f":"IF(ISBLANK(partije!R163),\"\",partije!R163)","v":""},{"$f":"IF(ISBLANK(partije!$D$163),\"\",partije!$D$163)","v":""},{"$f":"IF(ISBLANK(partije!$E$163),\"\",\"sto \"&partije!$E$163)","v":""},{"$f":"$S$15","v":2},{"$f":"$T$15","v":3}]
[]
[{"$nulls":3},"grupa 16"]
[null,"br.",null,"igrač",1,null,2,null,3,null,4,null,"pobede","porazi","mesto",null,"plasman grupe 16"]
[1,{"v":161,"d":"16-1"},{"$f":"IF(ISNA(MATCH(B215,spisak!$F$4:$F$308,0)),\"\",INDEX(spisak!$C$4:$C$308,MATCH(B215,spisak!$F$4:$F$308,0)))","v":"Spartak"},{"$f":"IF(ISNA(MATCH(B215,spisak!$F$4:$F$308,0)),\"bye\",INDEX(spisak!$B$4:$B$308,MATCH(B215,spisak!$F$4:$F$308,0)))","v":"Jozić Marino"},null,null,{"$f":"INDEX(E220:E225,MATCH(D215&D216,C220:C225&D220:D225,0))&\"/\"&INDEX(F220:F225,MATCH(D215&D216,C220:C225&D220:D225,0))","v":"3/0"},null,{"$f":"INDEX(E220:E225,MATCH(D215&D217,C220:C225&D220:D225,0))&\"/\"&INDEX(F220:F225,MATCH(D215&D217,C220:C225&D220:D225,0))","v":"3/0"},null,{"$f":"INDEX(E220:E225,MATCH(D215&D218,C220:C225&D220:D225,0))&\"/\"&INDEX(F220:F225,MATCH(D215&D218,C220:C225&D220:D225,0))","v":"/"},null,{"$f":"IF(ISBLANK(partije!$J$2),\"\",COUNTIFS(C220:C225,D215,E220:E225,3)+COUNTIFS(D220:D225,D215,F220:F225,3))","v":2},{"$f":"IF(ISBLANK(partije!$J$2),\"\",COUNTIFS(C220:C225,D215,E220:E225,\"<3\")+COUNTIFS(D220:D225,D215,F220:F225,\"<3\"))","v":0},1,1,{"$f":"IF(ISBLANK(D215),\"*\",INDEX(D215:D218,MATCH(P215,O215:O218,0)))","v":"Jozić Marino"}]
[2,{"v":162,"d":"16-2"},{"$f":"IF(ISNA(MATCH(B216,spisak!$F$4:$F$308,0)),\"\",INDEX(spisak!$C$4:$C$308,MATCH(B216,spisak!$F$4:$F$308,0)))","v":"Stoni"},{"$f":"IF(ISNA(MATCH(B216,spisak!$F$4:$F$308,0)),\"bye\",INDEX(spisak!$B$4:$B$308,MATCH(B216,spisak!$F$4:$F$308,0)))","v":"Vasić Bogdan"},{"$f":"INDEX(F220:F225,MATCH(D215&D216,C220:C225&D220:D225,0))&\"/\"&INDEX(E220:E225,MATCH(D215&D216,C220:C225&D220:D225,0))","v":"0/3"},{"$nulls":3},{"$f":"INDEX(E220:E225,MATCH(D216&D217,C220:C225&D220:D225,0))&\"/\"&INDEX(F220:F225,MATCH(D216&D217,C220:C225&D220:D225,0))","v":"3/0"},null,{"$f":"INDEX(E220:E225,MATCH(D216&D218,C220:C225&D220:D225,0))&\"/\"&INDEX(F220:F225,MATCH(D216&D218,C220:C225&D220:D225,0))","v":"/"},null,{"$f":"IF(ISBLANK(partije!$J$2),\"\",COUNTIFS(C220:C225,D216,E220:E225,3)+COUNTIFS(D220:D225,D216,F220:F225,3))","v":1},{"$f":"IF(ISBLANK(partije!$J$2),\"\",COUNTIFS(C220:C225,D216,E220:E225,\"<3\")+COUNTIFS(D220:D225,D216,F220:F225,\"<3\"))","v":1},2,2,{"$f":"IF(ISBLANK(D216),\"*\",INDEX(D215:D218,MATCH(P216,O215:O218,0)))","v":"Vasić Bogdan"}]
[3,{"v":163,"d":"16-3"},{"$f":"IF(ISNA(MATCH(B217,spisak!$F$4:$F$308,0)),\"\",INDEX(spisak!$C$4:$C$308,MATCH(B217,spisak!$F$4:$F$308,0)))","v":"Barajevo"},{"$f":"IF(ISNA(MATCH(B217,spisak!$F$4:$F$308,0)),\"bye\",INDEX(spisak!$B$4:$B$308,MATCH(B217,spisak!$F$4:$F$308,0)))","v":"Vičević Luka"},{"$f":"INDEX(F220:F225,MATCH(D215&D217,C220:C225&D220:D225,0))&\"/\"&INDEX(E220:E225,MATCH(D215&D217,C220:C225&D220:D225,0))","v":"0/3"},null,{"$f":"INDEX(F220:F225,MATCH(D216&D217,C220:C225&D220:D225,0))&\"/\"&INDEX(E220:E225,MATCH(D216&D217,C220:C225&D220:D225,0))","v":"0/3"},{"$nulls":3},{"$f":"INDEX(E220:E225,MATCH(D217&D218,C220:C225&D220:D225,0))&\"/\"&INDEX(F220:F225,MATCH(D217&D218,C220:C225&D220:D225,0))","v":"/"},null,{"$f":"IF(ISBLANK(partije!$J$2),\"\",COUNTIFS(C220:C225,D217,E220:E225,3)+COUNTIFS(D220:D225,D217,F220:F225,3))","v":0},{"$f":"IF(ISBLANK(partije!$J$2),\"\",COUNTIFS(C220:C225,D217,E220:E225,\"<3\")+COUNTIFS(D220:D225,D217,F220:F225,\"<3\"))","v":2},3,3,{"$f":"IF(ISBLANK(D217),\"*\",INDEX(D215:D218,MATCH(P217,O215:O218,0)))","v":"Vičević Luka"}]
[4,{"v":164,"d":"16-4"},{"$f":"IF(ISNA(MATCH(B218,spisak!$F$4:$F$308,0)),\"\",INDEX(spisak!$C$4:$C$308,MATCH(B218,spisak!$F$4:$F$308,0)))","v":""},{"$f":"IF(ISNA(MATCH(B218,spisak!$F$4:$F$308,0)),\"bye\",INDEX(spisak!$B$4:$B$308,MATCH(B218,spisak!$F$4:$F$308,0)))","v":"bye"},{"$f":"INDEX(F220:F225,MATCH(D215&D218,C220:C225&D220:D225,0))&\"/\"&INDEX(E220:E225,MATCH(D215&D218,C220:C225&D220:D225,0))","v":"/"},null,{"$f":"INDEX(F220:F225,MATCH(D216&D218,C220:C225&D220:D225,0))&\"/\"&INDEX(E220:E225,MATCH(D216&D218,C220:C225&D220:D225,0))","v":"/"},null,{"$f":"INDEX(F220:F225,MATCH(D217&D218,C220:C225&D220:D225,0))&\"/\"&INDEX(E220:E225,MATCH(D217&D218,C220:C225&D220:D225,0))","v":"/"},{"$nulls":3},{"$f":"IF(ISBLANK(partije!$J$2),\"\",COUNTIFS(C220:C225,D218,E220:E225,3)+COUNTIFS(D220:D225,D218,F220:F225,3))","v":0},{"$f":"IF(ISBLANK(partije!$J$2),\"\",COUNTIFS(C220:C225,D218,E220:E225,\"<3\")+COUNTIFS(D220:D225,D218,F220:F225,\"<3\"))","v":0},null,4,{"$f":"IF(ISBLANK(D218),\"*\",INDEX(D215:D218,MATCH(P218,O215:O218,0)))","v":{"$error":"#N/A"}}]
[{"$nulls":4},"rezultat",null,"set1",null,"set 2",null,"set 3",null,"set 4","set 5","set 6","set 7",null,null,"berger4"]
[{"$f":"IF(ISBLANK(partije!D32),\"\",partije!D32)","v":""},{"$f":"IF(ISBLANK(partije!E32),\"\",partije!E32)","v":""},{"$f":"INDEX(D215:D218,MATCH(S220,A215:A218,0))","v":"Jozić Marino"},{"$f":"INDEX(D215:D218,MATCH(T220,A215:A218,0))","v":"Vičević Luka"},{"$f":"IF(ISBLANK(partije!J32),\"\",partije!J32)","v":3},{"$f":"IF(ISBLANK(partije!K32),\"\",partije!K32)","v":0},{"$f":"IF(ISBLANK(partije!L32),\"\",partije!L32)","v":{"v":1210,"d":"12-10"}},null,{"$f":"IF(ISBLANK(partije!M32),\"\",partije!M32)","v":{"v":1109,"d":"11-09"}},null,{"$f":"IF(ISBLANK(partije!N32),\"\",partije!N32)","v":{"v":1102,"d":"11-02"}},{"$f":"IF(ISBLANK(partije!M32),\"\",partije!M32)","v":{"v":1109,"d":"11-09"}},{"$f":"IF(ISBLANK(partije!O32),\"\",partije!O32)","v":""},{"$f":"IF(ISBLANK(partije!P32),\"\",partije!P32)","v":""},{"$f":"IF(ISBLANK(partije!Q32),\"\",partije!Q32)","v":""},{"$f":"IF(ISBLANK(partije!R32),\"\",partije!R32)","v":""},{"$f":"IF(ISBLANK(partije!$D$32),\"\",partije!$D$32)","v":""},{"$f":"IF(ISBLANK(partije!$E$32),\"\",\"sto \"&partije!$E$32)","v":""},{"$f":"$S$10","v":1},{"$f":"$T$10","v":3}]
[{"$f":"IF(ISBLANK(partije!D33),\"\",partije!D33)","v":""},{"$f":"IF(ISBLANK(partije!E33),\"\",partije!E33)","v":""},{"$f":"INDEX(D215:D218,MATCH(S221,A215:A218,0))","v":"Vasić Bogdan"},{"$f":"INDEX(D215:D218,MATCH(T221,A215:A218,0))","v":"bye"},{"$f":"IF(ISBLANK(partije!J33),\"\",partije!J33)","v":""},{"$f":"IF(ISBLANK(partije!K33),\"\",partije!K33)","v":""},{"$f":"IF(ISBLANK(partije!L33),\"\",partije!L33)","v":""},null,{"$f":"IF(ISBLANK(partije!M33),\"\",partije!M33)","v":""},null,{"$f":"IF(ISBLANK(partije!N33),\"\",partije!N33)","v":""},{"$f":"IF(ISBLANK(partije!M33),\"\",partije!M33)","v":""},{"$f":"IF(ISBLANK(partije!O33),\"\",partije!O33)","v":""},{"$f":"IF(ISBLANK(partije!P33),\"\",partije!P33)","v":""},{"$f":"IF(ISBLANK(partije!Q33),\"\",partije!Q33)","v":""},{"$f":"IF(ISBLANK(partije!R33),\"\",partije!R33)","v":""},{"$f":"IF(ISBLANK(partije!$D$33),\"\",partije!$D$33)","v":""},{"$f":"IF(ISBLANK(partije!$E$33),\"\",\"sto \"&partije!$E$33)","v":""},{"$f":"$S$11","v":2},{"$f":"$T$11","v":4}]
[{"$f":"IF(ISBLANK(partije!D98),\"\",partije!D98)","v":""},{"$f":"IF(ISBLANK(partije!E98),\"\",partije!E98)","v":""},{"$f":"INDEX(D215:D218,MATCH(S222,A215:A218,0))","v":"Jozić Marino"},{"$f":"INDEX(D215:D218,MATCH(T222,A215:A218,0))","v":"Vasić Bogdan"},{"$f":"IF(ISBLANK(partije!J98),\"\",partije!J98)","v":3},{"$f":"IF(ISBLANK(partije!K98),\"\",partije!K98)","v":0},{"$f":"IF(ISBLANK(partije!L98),\"\",partije!L98)","v":{"v":1104,"d":"11-04"}},null,{"$f":"IF(ISBLANK(partije!M98),\"\",partije!M98)","v":{"v":1105,"d":"11-05"}},null,{"$f":"IF(ISBLANK(partije!N98),\"\",partije!N98)","v":{"v":1104,"d":"11-04"}},{"$f":"IF(ISBLANK(partije!M98),\"\",partije!M98)","v":{"v":1105,"d":"11-05"}},{"$f":"IF(ISBLANK(partije!O98),\"\",partije!O98)","v":""},{"$f":"IF(ISBLANK(partije!P98),\"\",partije!P98)","v":""},{"$f":"IF(ISBLANK(partije!Q98),\"\",partije!Q98)","v":""},{"$f":"IF(ISBLANK(partije!R98),\"\",partije!R98)","v":""},{"$f":"IF(ISBLANK(partije!$D$98),\"\",partije!$D$98)","v":""},{"$f":"IF(ISBLANK(partije!$E$98),\"\",\"sto \"&partije!$E$98)","v":""},{"$f":"$S$12","v":1},{"$f":"$T$12","v":2}]
[{"$f":"IF(ISBLANK(partije!D99),\"\",partije!D99)","v":""},{"$f":"IF(ISBLANK(partije!E99),\"\",partije!E99)","v":""},{"$f":"INDEX(D215:D218,MATCH(S223,A215:A218,0))","v":"Vičević Luka"},{"$f":"INDEX(D215:D218,MATCH(T223,A215:A218,0))","v":"bye"},{"$f":"IF(ISBLANK(partije!J99),\"\",partije!J99)","v":""},{"$f":"IF(ISBLANK(partije!K99),\"\",partije!K99)","v":""},{"$f":"IF(ISBLANK(partije!L99),\"\",partije!L99)","v":""},null,{"$f":"IF(ISBLANK(partije!M99),\"\",partije!M99)","v":""},null,{"$f":"IF(ISBLANK(partije!N99),\"\",partije!N99)","v":""},{"$f":"IF(ISBLANK(partije!M99),\"\",partije!M99)","v":""},{"$f":"IF(ISBLANK(partije!O99),\"\",partije!O99)","v":""},{"$f":"IF(ISBLANK(partije!P99),\"\",partije!P99)","v":""},{"$f":"IF(ISBLANK(partije!Q99),\"\",partije!Q99)","v":""},{"$f":"IF(ISBLANK(partije!R99),\"\",partije!R99)","v":""},{"$f":"IF(ISBLANK(partije!$D$99),\"\",partije!$D$99)","v":""},{"$f":"IF(ISBLANK(partije!$E$99),\"\",\"sto \"&partije!$E$99)","v":""},{"$f":"$S$13","v":3},{"$f":"$T$13","v":4}]
[{"$f":"IF(ISBLANK(partije!D164),\"\",partije!D164)","v":""},{"$f":"IF(ISBLANK(partije!E164),\"\",partije!E164)","v":""},{"$f":"INDEX(D215:D218,MATCH(S224,A215:A218,0))","v":"Jozić Marino"},{"$f":"INDEX(D215:D218,MATCH(T224,A215:A218,0))","v":"bye"},{"$f":"IF(ISBLANK(partije!J164),\"\",partije!J164)","v":""},{"$f":"IF(ISBLANK(partije!K164),\"\",partije!K164)","v":""},{"$f":"IF(ISBLANK(partije!L164),\"\",partije!L164)","v":""},null,{"$f":"IF(ISBLANK(partije!M164),\"\",partije!M164)","v":""},null,{"$f":"IF(ISBLANK(partije!N164),\"\",partije!N164)","v":""},{"$f":"IF(ISBLANK(partije!M164),\"\",partije!M164)","v":""},{"$f":"IF(ISBLANK(partije!O164),\"\",partije!O164)","v":""},{"$f":"IF(ISBLANK(partije!P164),\"\",partije!P164)","v":""},{"$f":"IF(ISBLANK(partije!Q164),\"\",partije!Q164)","v":""},{"$f":"IF(ISBLANK(partije!R164),\"\",partije!R164)","v":""},{"$f":"IF(ISBLANK(partije!$D$164),\"\",partije!$D$164)","v":""},{"$f":"IF(ISBLANK(partije!$E$164),\"\",\"sto \"&partije!$E$164)","v":""},{"$f":"$S$14","v":1},{"$f":"$T$14","v":4}]
[{"$f":"IF(ISBLANK(partije!D165),\"\",partije!D165)","v":""},{"$f":"IF(ISBLANK(partije!E165),\"\",partije!E165)","v":""},{"$f":"INDEX(D215:D218,MATCH(S225,A215:A218,0))","v":"Vasić Bogdan"},{"$f":"INDEX(D215:D218,MATCH(T225,A215:A218,0))","v":"Vičević Luka"},{"$f":"IF(ISBLANK(partije!J165),\"\",partije!J165)","v":3},{"$f":"IF(ISBLANK(partije!K165),\"\",partije!K165)","v":0},{"$f":"IF(ISBLANK(partije!L165),\"\",partije!L165)","v":{"v":1101,"d":"11-01"}},null,{"$f":"IF(ISBLANK(partije!M165),\"\",partije!M165)","v":{"v":1107,"d":"11-07"}},null,{"$f":"IF(ISBLANK(partije!N165),\"\",partije!N165)","v":{"v":1108,"d":"11-08"}},{"$f":"IF(ISBLANK(partije!M165),\"\",partije!M165)","v":{"v":1107,"d":"11-07"}},{"$f":"IF(ISBLANK(partije!O165),\"\",partije!O165)","v":""},{"$f":"IF(ISBLANK(partije!P165),\"\",partije!P165)","v":""},{"$f":"IF(ISBLANK(partije!Q165),\"\",partije!Q165)","v":""},{"$f":"IF(ISBLANK(partije!R165),\"\",partije!R165)","v":""},{"$f":"IF(ISBLANK(partije!$D$165),\"\",partije!$D$165)","v":""},{"$f":"IF(ISBLANK(partije!$E$165),\"\",\"sto \"&partije!$E$165)","v":""},{"$f":"$S$15","v":2},{"$f":"$T$15","v":3}]
[]
[]
[null,"br."]
[1,{"v":171,"d":"17-1"}]
[2,{"v":172,"d":"17-2"}]
[3,{"v":173,"d":"17-3"}]
[4,{"v":174,"d":"17-4"}]
[]
[{"$f":"IF(ISBLANK(partije!D34),\"\",partije!D34)","v":""},{"$f":"IF(ISBLANK(partije!E34),\"\",partije!E34)","v":""}]
[{"$f":"IF(ISBLANK(partije!D35),\"\",partije!D35)","v":""},{"$f":"IF(ISBLANK(partije!E35),\"\",partije!E35)","v":""}]
[{"$f":"IF(ISBLANK(partije!D100),\"\",partije!D100)","v":""},{"$f":"IF(ISBLANK(partije!E100),\"\",partije!E100)","v":""}]
[{"$f":"IF(ISBLANK(partije!D101),\"\",partije!D101)","v":""},{"$f":"IF(ISBLANK(partije!E101),\"\",partije!E101)","v":""}]
[{"$f":"IF(ISBLANK(partije!D166),\"\",partije!D166)","v":""},{"$f":"IF(ISBLANK(partije!E166),\"\",partije!E166)","v":""}]
[{"$f":"IF(ISBLANK(partije!D167),\"\",partije!D167)","v":""},{"$f":"IF(ISBLANK(partije!E167),\"\",partije!E167)","v":""}]
[]
[]
[null,"br."]
[1,{"v":181,"d":"18-1"}]
[2,{"v":182,"d":"18-2"}]
[3,{"v":183,"d":"18-3"}]
[4,{"v":184,"d":"18-4"}]
[]
[{"$f":"IF(ISBLANK(partije!D36),\"\",partije!D36)","v":""},{"$f":"IF(ISBLANK(partije!E36),\"\",partije!E36)","v":""}]
[{"$f":"IF(ISBLANK(partije!D37),\"\",partije!D37)","v":""},{"$f":"IF(ISBLANK(partije!E37),\"\",partije!E37)","v":""}]
[{"$f":"IF(ISBLANK(partije!D102),\"\",partije!D102)","v":""},{"$f":"IF(ISBLANK(partije!E102),\"\",partije!E102)","v":""}]
[{"$f":"IF(ISBLANK(partije!D103),\"\",partije!D103)","v":""},{"$f":"IF(ISBLANK(partije!E103),\"\",partije!E103)","v":""}]
[{"$f":"IF(ISBLANK(partije!D168),\"\",partije!D168)","v":""},{"$f":"IF(ISBLANK(partije!E168),\"\",partije!E168)","v":""}]
[{"$f":"IF(ISBLANK(partije!D169),\"\",partije!D169)","v":""},{"$f":"IF(ISBLANK(partije!E169),\"\",partije!E169)","v":""}]
[]
[]
[null,"br."]
[1,{"v":191,"d":"19-1"}]
[2,{"v":192,"d":"19-2"}]
[3,{"v":193,"d":"19-3"}]
[4,{"v":194,"d":"19-4"}]
[]
[{"$f":"IF(ISBLANK(partije!D38),\"\",partije!D38)","v":""},{"$f":"IF(ISBLANK(partije!E38),\"\",partije!E38)","v":""}]
[{"$f":"IF(ISBLANK(partije!D39),\"\",partije!D39)","v":""},{"$f":"IF(ISBLANK(partije!E39),\"\",partije!E39)","v":""}]
[{"$f":"IF(ISBLANK(partije!D104),\"\",partije!D104)","v":""},{"$f":"IF(ISBLANK(partije!E104),\"\",partije!E104)","v":""}]
[{"$f":"IF(ISBLANK(partije!D105),\"\",partije!D105)","v":""},{"$f":"IF(ISBLANK(partije!E105),\"\",partije!E105)","v":""}]
[{"$f":"IF(ISBLANK(partije!D170),\"\",partije!D170)","v":""},{"$f":"IF(ISBLANK(partije!E170),\"\",partije!E170)","v":""}]
[{"$f":"IF(ISBLANK(partije!D171),\"\",partije!D171)","v":""},{"$f":"IF(ISBLANK(partije!E171),\"\",partije!E171)","v":""}]
[]
[]
[null,"br."]
[1,{"v":201,"d":"20-1"}]
[2,{"v":202,"d":"20-2"}]
[3,{"v":203,"d":"20-3"}]
[4,{"v":204,"d":"20-4"}]
[]
[{"$f":"IF(ISBLANK(partije!D40),\"\",partije!D40)","v":""},{"$f":"IF(ISBLANK(partije!E40),\"\",partije!E40)","v":""}]
[{"$f":"IF(ISBLANK(partije!D41),\"\",partije!D41)","v":""},{"$f":"IF(ISBLANK(partije!E41),\"\",partije!E41)","v":""}]
[{"$f":"IF(ISBLANK(partije!D106),\"\",partije!D106)","v":""},{"$f":"IF(ISBLANK(partije!E106),\"\",partije!E106)","v":""}]
[{"$f":"IF(ISBLANK(partije!D107),\"\",partije!D107)","v":""},{"$f":"IF(ISBLANK(partije!E107),\"\",partije!E107)","v":""}]
[{"$f":"IF(ISBLANK(partije!D172),\"\",partije!D172)","v":""},{"$f":"IF(ISBLANK(partije!E172),\"\",partije!E172)","v":""}]
[{"$f":"IF(ISBLANK(partije!D173),\"\",partije!D173)","v":""},{"$f":"IF(ISBLANK(partije!E173),\"\",partije!E173)","v":""}]
[]
[]
[null,"br."]
[1,{"v":211,"d":"21-1"}]
[2,{"v":212,"d":"21-2"}]
[3,{"v":213,"d":"21-3"}]
[4,{"v":214,"d":"21-4"}]
[]
[{"$f":"IF(ISBLANK(partije!D42),\"\",partije!D42)","v":""},{"$f":"IF(ISBLANK(partije!E42),\"\",partije!E42)","v":""}]
[{"$f":"IF(ISBLANK(partije!D43),\"\",partije!D43)","v":""},{"$f":"IF(ISBLANK(partije!E43),\"\",partije!E43)","v":""}]
[{"$f":"IF(ISBLANK(partije!D108),\"\",partije!D108)","v":""},{"$f":"IF(ISBLANK(partije!E108),\"\",partije!E108)","v":""}]
[{"$f":"IF(ISBLANK(partije!D109),\"\",partije!D109)","v":""},{"$f":"IF(ISBLANK(partije!E109),\"\",partije!E109)","v":""}]
[{"$f":"IF(ISBLANK(partije!D174),\"\",partije!D174)","v":""},{"$f":"IF(ISBLANK(partije!E174),\"\",partije!E174)","v":""}]
[{"$f":"IF(ISBLANK(partije!D175),\"\",partije!D175)","v":""},{"$f":"IF(ISBLANK(partije!E175),\"\",partije!E175)","v":""}]
[]
[]
[null,"br."]
[1,{"v":221,"d":"22-1"}]
[2,{"v":222,"d":"22-2"}]
[3,{"v":223,"d":"22-3"}]
[4,{"v":224,"d":"22-4"}]
[]
[{"$f":"IF(ISBLANK(partije!D44),\"\",partije!D44)","v":""},{"$f":"IF(ISBLANK(partije!E44),\"\",partije!E44)","v":""}]
[{"$f":"IF(ISBLANK(partije!D45),\"\",partije!D45)","v":""},{"$f":"IF(ISBLANK(partije!E45),\"\",partije!E45)","v":""}]
[{"$f":"IF(ISBLANK(partije!D110),\"\",partije!D110)","v":""},{"$f":"IF(ISBLANK(partije!E110),\"\",partije!E110)","v":""}]
[{"$f":"IF(ISBLANK(partije!D111),\"\",partije!D111)","v":""},{"$f":"IF(ISBLANK(partije!E111),\"\",partije!E111)","v":""}]
[{"$f":"IF(ISBLANK(partije!D176),\"\",partije!D176)","v":""},{"$f":"IF(ISBLANK(partije!E176),\"\",partije!E176)","v":""}]
[{"$f":"IF(ISBLANK(partije!D177),\"\",partije!D177)","v":""},{"$f":"IF(ISBLANK(partije!E177),\"\",partije!E177)","v":""}]
[]
[]
[null,"br."]
[1,{"v":231,"d":"23-1"}]
[2,{"v":232,"d":"23-2"}]
[3,{"v":233,"d":"23-3"}]
[4,{"v":234,"d":"23-4"}]
[]
[{"$f":"IF(ISBLANK(partije!D46),\"\",partije!D46)","v":""},{"$f":"IF(ISBLANK(partije!E46),\"\",partije!E46)","v":""}]
[{"$f":"IF(ISBLANK(partije!D47),\"\",partije!D47)","v":""},{"$f":"IF(ISBLANK(partije!E47),\"\",partije!E47)","v":""}]
[{"$f":"IF(ISBLANK(partije!D112),\"\",partije!D112)","v":""},{"$f":"IF(ISBLANK(partije!E112),\"\",partije!E112)","v":""}]
[{"$f":"IF(ISBLANK(partije!D113),\"\",partije!D113)","v":""},{"$f":"IF(ISBLANK(partije!E113),\"\",partije!E113)","v":""}]
[{"$f":"IF(ISBLANK(partije!D178),\"\",partije!D178)","v":""},{"$f":"IF(ISBLANK(partije!E178),\"\",partije!E178)","v":""}]
[{"$f":"IF(ISBLANK(partije!D179),\"\",partije!D179)","v":""},{"$f":"IF(ISBLANK(partije!E179),\"\",partije!E179)","v":""}]
[]
[]
[null,"br."]
[1,{"v":241,"d":"24-1"}]
[2,{"v":242,"d":"24-2"}]
[3,{"v":243,"d":"24-3"}]
[4,{"v":244,"d":"24-4"}]
[]
[{"$f":"IF(ISBLANK(partije!D48),\"\",partije!D48)","v":""},{"$f":"IF(ISBLANK(partije!E48),\"\",partije!E48)","v":""}]
[{"$f":"IF(ISBLANK(partije!D49),\"\",partije!D49)","v":""},{"$f":"IF(ISBLANK(partije!E49),\"\",partije!E49)","v":""}]
[{"$f":"IF(ISBLANK(partije!D114),\"\",partije!D114)","v":""},{"$f":"IF(ISBLANK(partije!E114),\"\",partije!E114)","v":""}]
[{"$f":"IF(ISBLANK(partije!D115),\"\",partije!D115)","v":""},{"$f":"IF(ISBLANK(partije!E115),\"\",partije!E115)","v":""}]
[{"$f":"IF(ISBLANK(partije!D180),\"\",partije!D180)","v":""},{"$f":"IF(ISBLANK(partije!E180),\"\",partije!E180)","v":""}]
[{"$f":"IF(ISBLANK(partije!D181),\"\",partije!D181)","v":""},{"$f":"IF(ISBLANK(partije!E181),\"\",partije!E181)","v":""}]
[]
[]
[null,"br."]
[1,{"v":251,"d":"25-1"}]
[2,{"v":252,"d":"25-2"}]
[3,{"v":253,"d":"25-3"}]
[4,{"v":254,"d":"25-4"}]
[]
[{"$f":"IF(ISBLANK(partije!D50),\"\",partije!D50)","v":""},{"$f":"IF(ISBLANK(partije!E50),\"\",partije!E50)","v":""}]
[{"$f":"IF(ISBLANK(partije!D51),\"\",partije!D51)","v":""},{"$f":"IF(ISBLANK(partije!E51),\"\",partije!E51)","v":""}]
[{"$f":"IF(ISBLANK(partije!D116),\"\",partije!D116)","v":""},{"$f":"IF(ISBLANK(partije!E116),\"\",partije!E116)","v":""}]
[{"$f":"IF(ISBLANK(partije!D117),\"\",partije!D117)","v":""},{"$f":"IF(ISBLANK(partije!E117),\"\",partije!E117)","v":""}]
[{"$f":"IF(ISBLANK(partije!D182),\"\",partije!D182)","v":""},{"$f":"IF(ISBLANK(partije!E182),\"\",partije!E182)","v":""}]
[{"$f":"IF(ISBLANK(partije!D183),\"\",partije!D183)","v":""},{"$f":"IF(ISBLANK(partije!E183),\"\",partije!E183)","v":""}]
[]
[]
[null,"br."]
[1,{"v":261,"d":"26-1"}]
[2,{"v":262,"d":"26-2"}]
[3,{"v":263,"d":"26-3"}]
[4,{"v":264,"d":"26-4"}]
[]
[{"$f":"IF(ISBLANK(partije!D52),\"\",partije!D52)","v":""},{"$f":"IF(ISBLANK(partije!E52),\"\",partije!E52)","v":""}]
[{"$f":"IF(ISBLANK(partije!D53),\"\",partije!D53)","v":""},{"$f":"IF(ISBLANK(partije!E53),\"\",partije!E53)","v":""}]
[{"$f":"IF(ISBLANK(partije!D118),\"\",partije!D118)","v":""},{"$f":"IF(ISBLANK(partije!E118),\"\",partije!E118)","v":""}]
[{"$f":"IF(ISBLANK(partije!D119),\"\",partije!D119)","v":""},{"$f":"IF(ISBLANK(partije!E119),\"\",partije!E119)","v":""}]
[{"$f":"IF(ISBLANK(partije!D184),\"\",partije!D184)","v":""},{"$f":"IF(ISBLANK(partije!E184),\"\",partije!E184)","v":""}]
[{"$f":"IF(ISBLANK(partije!D185),\"\",partije!D185)","v":""},{"$f":"IF(ISBLANK(partije!E185),\"\",partije!E185)","v":""}]
[]
[]
[null,"br."]
[1,{"v":271,"d":"27-1"}]
[2,{"v":272,"d":"27-2"}]
[3,{"v":273,"d":"27-3"}]
[4,{"v":274,"d":"27-4"}]
[]
[{"$f":"IF(ISBLANK(partije!D54),\"\",partije!D54)","v":""},{"$f":"IF(ISBLANK(partije!E54),\"\",partije!E54)","v":""}]
[{"$f":"IF(ISBLANK(partije!D55),\"\",partije!D55)","v":""},{"$f":"IF(ISBLANK(partije!E55),\"\",partije!E55)","v":""}]
[{"$f":"IF(ISBLANK(partije!D120),\"\",partije!D120)","v":""},{"$f":"IF(ISBLANK(partije!E120),\"\",partije!E120)","v":""}]
[{"$f":"IF(ISBLANK(partije!D121),\"\",partije!D121)","v":""},{"$f":"IF(ISBLANK(partije!E121),\"\",partije!E121)","v":""}]
[{"$f":"IF(ISBLANK(partije!D186),\"\",partije!D186)","v":""},{"$f":"IF(ISBLANK(partije!E186),\"\",partije!E186)","v":""}]
[{"$f":"IF(ISBLANK(partije!D187),\"\",partije!D187)","v":""},{"$f":"IF(ISBLANK(partije!E187),\"\",partije!E187)","v":""}]
[]
[]
[null,"br."]
[1,{"v":281,"d":"28-1"}]
[2,{"v":282,"d":"28-2"}]
[3,{"v":283,"d":"28-3"}]
[4,{"v":284,"d":"28-4"}]
[]
[{"$f":"IF(ISBLANK(partije!D56),\"\",partije!D56)","v":""},{"$f":"IF(ISBLANK(partije!E56),\"\",partije!E56)","v":""}]
[{"$f":"IF(ISBLANK(partije!D57),\"\",partije!D57)","v":""},{"$f":"IF(ISBLANK(partije!E57),\"\",partije!E57)","v":""}]
[{"$f":"IF(ISBLANK(partije!D122),\"\",partije!D122)","v":""},{"$f":"IF(ISBLANK(partije!E122),\"\",partije!E122)","v":""}]
[{"$f":"IF(ISBLANK(partije!D123),\"\",partije!D123)","v":""},{"$f":"IF(ISBLANK(partije!E123),\"\",partije!E123)","v":""}]
[{"$f":"IF(ISBLANK(partije!D188),\"\",partije!D188)","v":""},{"$f":"IF(ISBLANK(partije!E188),\"\",partije!E188)","v":""}]
[{"$f":"IF(ISBLANK(partije!D189),\"\",partije!D189)","v":""},{"$f":"IF(ISBLANK(partije!E189),\"\",partije!E189)","v":""}]
[]
[]
[null,"br."]
[1,{"v":291,"d":"29-1"}]
[2,{"v":292,"d":"29-2"}]
[3,{"v":293,"d":"29-3"}]
[4,{"v":294,"d":"29-4"}]
[]
[{"$f":"IF(ISBLANK(partije!D58),\"\",partije!D58)","v":""},{"$f":"IF(ISBLANK(partije!E58),\"\",partije!E58)","v":""}]
[{"$f":"IF(ISBLANK(partije!D59),\"\",partije!D59)","v":""},{"$f":"IF(ISBLANK(partije!E59),\"\",partije!E59)","v":""}]
[{"$f":"IF(ISBLANK(partije!D124),\"\",partije!D124)","v":""},{"$f":"IF(ISBLANK(partije!E124),\"\",partije!E124)","v":""}]
[{"$f":"IF(ISBLANK(partije!D125),\"\",partije!D125)","v":""},{"$f":"IF(ISBLANK(partije!E125),\"\",partije!E125)","v":""}]
[{"$f":"IF(ISBLANK(partije!D190),\"\",partije!D190)","v":""},{"$f":"IF(ISBLANK(partije!E190),\"\",partije!E190)","v":""}]
[{"$f":"IF(ISBLANK(partije!D191),\"\",partije!D191)","v":""},{"$f":"IF(ISBLANK(partije!E191),\"\",partije!E191)","v":""}]
[]
[]
[null,"br."]
[1,{"v":301,"d":"30-1"}]
[2,{"v":302,"d":"30-2"}]
[3,{"v":303,"d":"30-3"}]
[4,{"v":304,"d":"30-4"}]
[]
[{"$f":"IF(ISBLANK(partije!D60),\"\",partije!D60)","v":""},{"$f":"IF(ISBLANK(partije!E60),\"\",partije!E60)","v":""}]
[{"$f":"IF(ISBLANK(partije!D61),\"\",partije!D61)","v":""},{"$f":"IF(ISBLANK(partije!E61),\"\",partije!E61)","v":""}]
[{"$f":"IF(ISBLANK(partije!D126),\"\",partije!D126)","v":""},{"$f":"IF(ISBLANK(partije!E126),\"\",partije!E126)","v":""}]
[{"$f":"IF(ISBLANK(partije!D127),\"\",partije!D127)","v":""},{"$f":"IF(ISBLANK(partije!E127),\"\",partije!E127)","v":""}]
[{"$f":"IF(ISBLANK(partije!D192),\"\",partije!D192)","v":""},{"$f":"IF(ISBLANK(partije!E192),\"\",partije!E192)","v":""}]
[{"$f":"IF(ISBLANK(partije!D193),\"\",partije!D193)","v":""},{"$f":"IF(ISBLANK(partije!E193),\"\",partije!E193)","v":""}]
[]
[]
[null,"br."]
[1,{"v":311,"d":"31-1"}]
[2,{"v":312,"d":"31-2"}]
[3,{"v":313,"d":"31-3"}]
[4,{"v":314,"d":"31-4"}]
[]
[{"$f":"IF(ISBLANK(partije!D62),\"\",partije!D62)","v":""},{"$f":"IF(ISBLANK(partije!E62),\"\",partije!E62)","v":""}]
[{"$f":"IF(ISBLANK(partije!D63),\"\",partije!D63)","v":""},{"$f":"IF(ISBLANK(partije!E63),\"\",partije!E63)","v":""}]
[{"$f":"IF(ISBLANK(partije!D128),\"\",partije!D128)","v":""},{"$f":"IF(ISBLANK(partije!E128),\"\",partije!E128)","v":""}]
[{"$f":"IF(ISBLANK(partije!D129),\"\",partije!D129)","v":""},{"$f":"IF(ISBLANK(partije!E129),\"\",partije!E129)","v":""}]
[{"$f":"IF(ISBLANK(partije!D194),\"\",partije!D194)","v":""},{"$f":"IF(ISBLANK(partije!E194),\"\",partije!E194)","v":""}]
[{"$f":"IF(ISBLANK(partije!D195),\"\",partije!D195)","v":""},{"$f":"IF(ISBLANK(partije!E195),\"\",partije!E195)","v":""}]
[]
[]
[null,"br."]
[1,{"v":321,"d":"32-1"}]
[2,{"v":322,"d":"32-2"}]
[3,{"v":323,"d":"32-3"}]
[4,{"v":324,"d":"32-4"}]
[]
[{"$f":"IF(ISBLANK(partije!D64),\"\",partije!D64)","v":""},{"$f":"IF(ISBLANK(partije!E64),\"\",partije!E64)","v":""}]
[{"$f":"IF(ISBLANK(partije!D65),\"\",partije!D65)","v":""},{"$f":"IF(ISBLANK(partije!E65),\"\",partije!E65)","v":""}]
[{"$f":"IF(ISBLANK(partije!D130),\"\",partije!D130)","v":""},{"$f":"IF(ISBLANK(partije!E130),\"\",partije!E130)","v":""}]
[{"$f":"IF(ISBLANK(partije!D131),\"\",partije!D131)","v":""},{"$f":"IF(ISBLANK(partije!E131),\"\",partije!E131)","v":""}]
[{"$f":"IF(ISBLANK(partije!D196),\"\",partije!D196)","v":""},{"$f":"IF(ISBLANK(partije!E196),\"\",partije!E196)","v":""}]
[{"$f":"IF(ISBLANK(partije!D197),\"\",partije!D197)","v":""},{"$f":"IF(ISBLANK(partije!E197),\"\",partije!E197)","v":""}]
[]
[]
[null,"br."]
[1,{"v":331,"d":"33-1"}]
[2,{"v":332,"d":"33-2"}]
[3,{"v":333,"d":"33-3"}]
[4,{"v":334,"d":"33-4"}]
[]
[{"$f":"IF(ISBLANK(partije!D66),\"\",partije!D66)","v":""},{"$f":"IF(ISBLANK(partije!E66),\"\",partije!E66)","v":""}]
[{"$f":"IF(ISBLANK(partije!D67),\"\",partije!D67)","v":""},{"$f":"IF(ISBLANK(partije!E67),\"\",partije!E67)","v":""}]
[{"$f":"IF(ISBLANK(partije!D132),\"\",partije!D132)","v":""},{"$f":"IF(ISBLANK(partije!E132),\"\",partije!E132)","v":""}]
[{"$f":"IF(ISBLANK(partije!D133),\"\",partije!D133)","v":""},{"$f":"IF(ISBLANK(partije!E133),\"\",partije!E133)","v":""}]
[{"$f":"IF(ISBLANK(partije!D198),\"\",partije!D198)","v":""},{"$f":"IF(ISBLANK(partije!E198),\"\",partije!E198)","v":""}]
[{"$f":"IF(ISBLANK(partije!D199),\"\",partije!D199)","v":""},{"$f":"IF(ISBLANK(partije!E199),\"\",partije!E199)","v":""}]

{"sheet":"plasman","index":3,"n_rows":68,"n_cols":10,"rows_kept":68,"merged":[[0,0,0,2],[0,3,0,4],[0,5,0,6]]}
[{"$f":"info!C3","v":"Otvoreno prvenstvo RSTSN"},null,null,"Plasman u grupama",null,{"$f":"info!C4","v":"mlađi kadeti"}]
["grupa","I mesto","klub","žreb","II mesto","klub","žreb"]
[1,{"$f":"grupe!Q5","v":"Ilić Bogdan"},{"$f":"INDEX(spisak!$C$4:$C$66,MATCH(B3,spisak!$B$4:$B$66,0))","v":"Napad"},1,{"$f":"grupe!Q6","v":"Zaharijev  Nikola"},{"$f":"INDEX(spisak!$C$4:$C$66,MATCH(E3,spisak!$B$4:$B$66,0))","v":"Mladost Bosilegrad"},22,{"$f":"B3","v":"Ilić Bogdan"},{"$f":"D3","v":1},{"$f":"C3","v":"Napad"}]
[2,{"$f":"grupe!Q19","v":"Šepa Matija"},{"$f":"INDEX(spisak!$C$4:$C$66,MATCH(B4,spisak!$B$4:$B$66,0))","v":"Stak Zemun"},32,{"$f":"grupe!Q20","v":"Putnik Dario"},{"$f":"INDEX(spisak!$C$4:$C$66,MATCH(E4,spisak!$B$4:$B$66,0))","v":"Milenijum"},2,{"$f":"B4","v":"Šepa Matija"},{"$f":"D4","v":32},{"$f":"C4","v":"Stak Zemun"}]
[3,{"$f":"grupe!Q33","v":"Stefanović Vanja"},{"$f":"INDEX(spisak!$C$4:$C$66,MATCH(B5,spisak!$B$4:$B$66,0))","v":"Stak Zemun"},17,{"$f":"grupe!Q34","v":"Velinović Miloš"},{"$f":"INDEX(spisak!$C$4:$C$66,MATCH(E5,spisak!$B$4:$B$66,0))","v":"Belo Polje"},15,"Stefanović Vanja",17,"Stak Zemun"]
[4,{"$f":"grupe!Q47","v":"Pavlović Dušan"},{"$f":"INDEX(spisak!$C$4:$C$66,MATCH(B6,spisak!$B$4:$B$66,0))","v":"Stak Zemun"},16,{"$f":"grupe!Q48","v":"Miovčić Mihailo"},{"$f":"INDEX(spisak!$C$4:$C$66,MATCH(E6,spisak!$B$4:$B$66,0))","v":"Sinđelić Beograd"},31,"Pavlović Dušan",16,"Stak Zemun"]
[5,{"$f":"grupe!Q61","v":"Jelikić Dimitrije"},{"$f":"INDEX(spisak!$C$4:$C$66,MATCH(B7,spisak!$B$4:$B$66,0))","v":"Crvena Zvezda Beograd"},24,{"$f":"grupe!Q62","v":"Kalinčević Vladimir"},{"$f":"INDEX(spisak!$C$4:$C$66,MATCH(E7,spisak!$B$4:$B$66,0))","v":"Sinđelić Beograd"},11,"Jelikić Dimitrije",24,"Crvena Zvezda Beograd"]
[6,{"$f":"grupe!Q75","v":"Varga Danijel"},{"$f":"INDEX(spisak!$C$4:$C$66,MATCH(B8,spisak!$B$4:$B$66,0))","v":"Temerin"},9,{"$f":"grupe!Q76","v":"Preslav Nikolov"},{"$f":"INDEX(spisak!$C$4:$C$66,MATCH(E8,spisak!$B$4:$B$66,0))","v":"Bdinci Bugarska"},18,"Varga Danijel",9,"Temerin"]
[7,{"$f":"grupe!Q89","v":"Pavlović Dimitrije"},{"$f":"INDEX(spisak!$C$4:$C$66,MATCH(B9,spisak!$B$4:$B$66,0))","v":"Stak Zemun"},8,{"$f":"grupe!Q90","v":"Dragin Saša"},{"$f":"INDEX(spisak!$C$4:$C$66,MATCH(E9,spisak!$B$4:$B$66,0))","v":"Borac Čačak"},19,"Pavlović Dimitrije",8,"Stak Zemun"]
[8,{"$f":"grupe!Q103","v":"Bošković Marko"},{"$f":"INDEX(spisak!$C$4:$C$66,MATCH(B10,spisak!$B$4:$B$66,0))","v":"Stak Zemun"},25,{"$f":"grupe!Q104","v":"Mladenović Ognjen"},{"$f":"INDEX(spisak!$C$4:$C$66,MATCH(E10,spisak!$B$4:$B$66,0))","v":"Prva Petoletka"},14,"Bošković Marko",25,"Stak Zemun"]
[9,{"$f":"grupe!Q117","v":"Ninković Uroš"},{"$f":"INDEX(spisak!$C$4:$C$66,MATCH(B11,spisak!$B$4:$B$66,0))","v":"Stak Zemun"},12,{"$f":"grupe!Q118","v":"Jovanović Đurađ"},{"$f":"INDEX(spisak!$C$4:$C$66,MATCH(E11,spisak!$B$4:$B$66,0))","v":"Sinđelić Beograd"},23,"Ninković Uroš",12,"Stak Zemun"]
[10,{"$f":"grupe!Q131","v":"Rajić Borislav"},{"$f":"INDEX(spisak!$C$4:$C$66,MATCH(B12,spisak!$B$4:$B$66,0))","v":"Novi Sad"},4,{"$f":"grupe!Q132","v":"Konstantinov Marko"},{"$f":"INDEX(spisak!$C$4:$C$66,MATCH(E12,spisak!$B$4:$B$66,0))","v":"Vršac"},30,"Rajić Borislav",4,"Novi Sad"]
[11,{"$f":"grupe!Q145","v":"Marinković Vasilije"},{"$f":"INDEX(spisak!$C$4:$C$66,MATCH(B13,spisak!$B$4:$B$66,0))","v":"Barajevo"},28,{"$f":"grupe!Q146","v":"Stefanović Luka"},{"$f":"INDEX(spisak!$C$4:$C$66,MATCH(E13,spisak!$B$4:$B$66,0))","v":"Novi Sad"},6,"Marinković Vasilije",28,"Barajevo"]
[12,{"$f":"grupe!Q159","v":"Radonjić Stefan"},{"$f":"INDEX(spisak!$C$4:$C$66,MATCH(B14,spisak!$B$4:$B$66,0))","v":"Milenijum"},20,{"$f":"grupe!Q160","v":"Marković Jovan"},{"$f":"INDEX(spisak!$C$4:$C$66,MATCH(E14,spisak!$B$4:$B$66,0))","v":"Vojvodina  Novi Sad"},10,"Radonjić Stefan",20,"Milenijum"]
[13,{"$f":"grupe!Q173","v":"Miljuš Luka"},{"$f":"INDEX(spisak!$C$4:$C$66,MATCH(B15,spisak!$B$4:$B$66,0))","v":"Vojvodina  Novi Sad"},5,{"$f":"grupe!Q174","v":"Pucarević Pavle"},{"$f":"INDEX(spisak!$C$4:$C$66,MATCH(E15,spisak!$B$4:$B$66,0))","v":"Hajduk Veljko"},26,"Miljuš Luka",5,"Vojvodina  Novi Sad"]
[14,{"$f":"grupe!Q187","v":"Gerginov Vanja"},{"$f":"INDEX(spisak!$C$4:$C$66,MATCH(B16,spisak!$B$4:$B$66,0))","v":"Novi Sad"},29,{"$f":"grupe!Q188","v":"Pavković Đorđe"},{"$f":"INDEX(spisak!$C$4:$C$66,MATCH(E16,spisak!$B$4:$B$66,0))","v":"Ozren Sokobanja"},3,"Gerginov Vanja",29,"Novi Sad"]
[15,{"$f":"grupe!Q201","v":"Paunović Petar"},{"$f":"INDEX(spisak!$C$4:$C$66,MATCH(B17,spisak!$B$4:$B$66,0))","v":"Stoni"},13,{"$f":"grupe!Q202","v":"Rajić Dalibor"},{"$f":"INDEX(spisak!$C$4:$C$66,MATCH(E17,spisak!$B$4:$B$66,0))","v":"Novi Sad"},27,"Paunović Petar",13,"Stoni"]
[16,{"$f":"grupe!Q215","v":"Jozić Marino"},{"$f":"INDEX(spisak!$C$4:$C$66,MATCH(B18,spisak!$B$4:$B$66,0))","v":"Spartak"},21,{"$f":"grupe!Q216","v":"Vasić Bogdan"},{"$f":"INDEX(spisak!$C$4:$C$66,MATCH(E18,spisak!$B$4:$B$66,0))","v":"Stoni"},7,"Jozić Marino",21,"Spartak"]
[17,{"$f":"grupe!Q229","v":0},{"$f":"INDEX(spisak!$C$4:$C$66,MATCH(B19,spisak!$B$4:$B$66,0))","v":{"$error":"#N/A"}},null,{"$f":"grupe!Q230","v":0},{"$f":"INDEX(spisak!$C$4:$C$66,MATCH(E19,spisak!$B$4:$B$66,0))","v":{"$error":"#N/A"}},null,0,0,{"$error":"#N/A"}]
[18,{"$f":"grupe!Q243","v":0},{"$f":"INDEX(spisak!$C$4:$C$66,MATCH(B20,spisak!$B$4:$B$66,0))","v":{"$error":"#N/A"}},null,{"$f":"grupe!Q244","v":0},{"$f":"INDEX(spisak!$C$4:$C$66,MATCH(E20,spisak!$B$4:$B$66,0))","v":{"$error":"#N/A"}},null,0,0,{"$error":"#N/A"}]
[19,{"$f":"grupe!Q257","v":0},{"$f":"INDEX(spisak!$C$4:$C$66,MATCH(B21,spisak!$B$4:$B$66,0))","v":{"$error":"#N/A"}},null,{"$f":"grupe!Q258","v":0},{"$f":"INDEX(spisak!$C$4:$C$66,MATCH(E21,spisak!$B$4:$B$66,0))","v":{"$error":"#N/A"}},null,0,0,{"$error":"#N/A"}]
[20,{"$f":"grupe!Q271","v":0},{"$f":"INDEX(spisak!$C$4:$C$66,MATCH(B22,spisak!$B$4:$B$66,0))","v":{"$error":"#N/A"}},null,{"$f":"grupe!Q272","v":0},{"$f":"INDEX(spisak!$C$4:$C$66,MATCH(E22,spisak!$B$4:$B$66,0))","v":{"$error":"#N/A"}},null,0,0,{"$error":"#N/A"}]
[21,{"$f":"grupe!Q285","v":0},{"$f":"INDEX(spisak!$C$4:$C$66,MATCH(B23,spisak!$B$4:$B$66,0))","v":{"$error":"#N/A"}},null,{"$f":"grupe!Q286","v":0},{"$f":"INDEX(spisak!$C$4:$C$66,MATCH(E23,spisak!$B$4:$B$66,0))","v":{"$error":"#N/A"}},null,0,0,{"$error":"#N/A"}]
[22,{"$f":"grupe!Q299","v":0},{"$f":"INDEX(spisak!$C$4:$C$66,MATCH(B24,spisak!$B$4:$B$66,0))","v":{"$error":"#N/A"}},null,{"$f":"grupe!Q300","v":0},{"$f":"INDEX(spisak!$C$4:$C$66,MATCH(E24,spisak!$B$4:$B$66,0))","v":{"$error":"#N/A"}},null,0,0,{"$error":"#N/A"}]
[23,{"$f":"grupe!Q313","v":0},{"$f":"INDEX(spisak!$C$4:$C$66,MATCH(B25,spisak!$B$4:$B$66,0))","v":{"$error":"#N/A"}},null,{"$f":"grupe!Q314","v":0},{"$f":"INDEX(spisak!$C$4:$C$66,MATCH(E25,spisak!$B$4:$B$66,0))","v":{"$error":"#N/A"}},null,0,0,{"$error":"#N/A"}]
[24,{"$f":"grupe!Q327","v":0},{"$f":"INDEX(spisak!$C$4:$C$66,MATCH(B26,spisak!$B$4:$B$66,0))","v":{"$error":"#N/A"}},null,{"$f":"grupe!Q328","v":0},{"$f":"INDEX(spisak!$C$4:$C$66,MATCH(E26,spisak!$B$4:$B$66,0))","v":{"$error":"#N/A"}},null,0,0,{"$error":"#N/A"}]
[25,{"$f":"grupe!Q341","v":0},{"$f":"INDEX(spisak!$C$4:$C$66,MATCH(B27,spisak!$B$4:$B$66,0))","v":{"$error":"#N/A"}},null,{"$f":"grupe!Q342","v":0},{"$f":"INDEX(spisak!$C$4:$C$66,MATCH(E27,spisak!$B$4:$B$66,0))","v":{"$error":"#N/A"}},null,0,0,{"$error":"#N/A"}]
[26,{"$f":"grupe!Q355","v":0},{"$f":"INDEX(spisak!$C$4:$C$66,MATCH(B28,spisak!$B$4:$B$66,0))","v":{"$error":"#N/A"}},null,{"$f":"grupe!Q356","v":0},{"$f":"INDEX(spisak!$C$4:$C$66,MATCH(E28,spisak!$B$4:$B$66,0))","v":{"$error":"#N/A"}},null,0,0,{"$error":"#N/A"}]
[27,{"$f":"grupe!Q369","v":0},{"$f":"INDEX(spisak!$C$4:$C$66,MATCH(B29,spisak!$B$4:$B$66,0))","v":{"$error":"#N/A"}},null,{"$f":"grupe!Q370","v":0},{"$f":"INDEX(spisak!$C$4:$C$66,MATCH(E29,spisak!$B$4:$B$66,0))","v":{"$error":"#N/A"}},null,0,0,{"$error":"#N/A"}]
[28,{"$f":"grupe!Q383","v":0},{"$f":"INDEX(spisak!$C$4:$C$66,MATCH(B30,spisak!$B$4:$B$66,0))","v":{"$error":"#N/A"}},null,{"$f":"grupe!Q384","v":0},{"$f":"INDEX(spisak!$C$4:$C$66,MATCH(E30,spisak!$B$4:$B$66,0))","v":{"$error":"#N/A"}},null,0,0,{"$error":"#N/A"}]
[29,{"$f":"grupe!Q397","v":0},{"$f":"INDEX(spisak!$C$4:$C$66,MATCH(B31,spisak!$B$4:$B$66,0))","v":{"$error":"#N/A"}},null,{"$f":"grupe!Q398","v":0},{"$f":"INDEX(spisak!$C$4:$C$66,MATCH(E31,spisak!$B$4:$B$66,0))","v":{"$error":"#N/A"}},null,0,0,{"$error":"#N/A"}]
[30,{"$f":"grupe!Q411","v":0},{"$f":"INDEX(spisak!$C$4:$C$66,MATCH(B32,spisak!$B$4:$B$66,0))","v":{"$error":"#N/A"}},null,{"$f":"grupe!Q412","v":0},{"$f":"INDEX(spisak!$C$4:$C$66,MATCH(E32,spisak!$B$4:$B$66,0))","v":{"$error":"#N/A"}},null,0,0,{"$error":"#N/A"}]
[31,{"$f":"grupe!Q425","v":0},{"$f":"INDEX(spisak!$C$4:$C$66,MATCH(B33,spisak!$B$4:$B$66,0))","v":{"$error":"#N/A"}},null,{"$f":"grupe!Q426","v":0},{"$f":"INDEX(spisak!$C$4:$C$66,MATCH(E33,spisak!$B$4:$B$66,0))","v":{"$error":"#N/A"}},null,0,0,{"$error":"#N/A"}]
[32,{"$f":"grupe!Q439","v":0},{"$f":"INDEX(spisak!$C$4:$C$66,MATCH(B34,spisak!$B$4:$B$66,0))","v":{"$error":"#N/A"}},null,{"$f":"grupe!Q440","v":0},{"$f":"INDEX(spisak!$C$4:$C$66,MATCH(E34,spisak!$B$4:$B$66,0))","v":{"$error":"#N/A"}},null,0,0,{"$error":"#N/A"}]
[33,{"$f":"grupe!Q453","v":0},{"$f":"INDEX(spisak!$C$4:$C$66,MATCH(B35,spisak!$B$4:$B$66,0))","v":{"$error":"#N/A"}},null,{"$f":"grupe!Q454","v":0},{"$f":"INDEX(spisak!$C$4:$C$66,MATCH(E35,spisak!$B$4:$B$66,0))","v":{"$error":"#N/A"}},null,0,0,{"$error":"#N/A"}]
[{"$nulls":7},{"$f":"E3","v":"Zaharijev  Nikola"},{"$f":"G3","v":22},{"$f":"F3","v":"Mladost Bosilegrad"}]
[{"$nulls":7},{"$f":"E4","v":"Putnik Dario"},{"$f":"G4","v":2},{"$f":"F4","v":"Milenijum"}]
[{"$nulls":7},"Velinović Miloš",15,{"$f":"F5","v":"Belo Polje"}]
[{"$nulls":7},"Miovčić Mihailo",31,"Sinđelić Beograd"]
[{"$nulls":7},"Kalinčević Vladimir",11,"Sinđelić Beograd"]
[{"$nulls":7},"Preslav Nikolov",18,"Bdinci Bugarska"]
[{"$nulls":7},"Dragin Saša",19,"Borac Čačak"]
[{"$nulls":7},"Mladenović Ognjen",14,"Prva Petoletka"]
[{"$nulls":7},"Jovanović Đurađ",23,"Sinđelić Beograd"]
[{"$nulls":7},"Konstantinov Marko",30,"Vršac"]
[{"$nulls":7},"Stefanović Luka",6,"Novi Sad"]
[{"$nulls":7},"Marković Jovan",10,"Vojvodina  Novi Sad"]
[{"$nulls":7},"Pucarević Pavle",26,"Hajduk Veljko"]
[{"$nulls":7},"Pavković Đorđe",3,"Ozren Sokobanja"]
[{"$nulls":7},"Rajić Dalibor",27,"Novi Sad"]
[{"$nulls":7},"Vasić Bogdan",7,"Stoni"]
[{"$nulls":7},0,0,{"$error":"#N/A"}]
[{"$nulls":7},0,0,{"$error":"#N/A"}]
[{"$nulls":7},0,0,{"$error":"#N/A"}]
[{"$nulls":7},0,0,{"$error":"#N/A"}]
[{"$nulls":7},0,0,{"$error":"#N/A"}]
[{"$nulls":7},0,0,{"$error":"#N/A"}]
[{"$nulls":7},0,0,{"$error":"#N/A"}]
[{"$nulls":7},0,0,{"$error":"#N/A"}]
[{"$nulls":7},{"$f":"E27","v":0},{"$f":"G27","v":0},{"$error":"#N/A"}]
[{"$nulls":7},{"$f":"E28","v":0},{"$f":"G28","v":0},{"$error":"#N/A"}]
[{"$nulls":7},0,0,{"$error":"#N/A"}]
[{"$nulls":7},0,0,{"$error":"#N/A"}]
[{"$nulls":7},0,0,{"$error":"#N/A"}]
[{"$nulls":7},0,0,{"$error":"#N/A"}]
[{"$nulls":7},{"$f":"E33","v":0},{"$f":"G33","v":0},{"$error":"#N/A"}]
[{"$nulls":7},{"$f":"E34","v":0},{"$f":"G34","v":0},{"$error":"#N/A"}]
[{"$nulls":7},0,0,{"$error":"#N/A"}]

{"sheet":"32","index":4,"n_rows":132,"n_cols":38,"rows_kept":132,"merged":[[2,2,2,5],[2,6,2,8],[2,9,3,13],[2,14,3,14],[2,15,3,15],[2,21,2,23],[2,24,2,29],[2,30,3,34],[2,35,3,35],[2,36,3,36],[3,0,4,0],[3,1,4,1],[3,2,4,5],[3,6,4,8],[3,24,4,29],[4,9,5,9],[4,10,5,10],[4,11,5,11],[4,12,5,12],[4,13,5,13],[4,14,5,14],[4,15,5,15],[4,16,5,20],[4,21,5,21],[4,22,5,22],[4,30,5,30],[4,31,5,31],[4,32,5,32],[4,33,5,33],[4,34,5,34],[4,35,5,35],[4,36,5,36],[5,0,6,0],[5,1,6,1],[5,2,6,5],[5,6,6,8],[6,9,7,13],[6,14,7,14],[6,15,7,15],[6,16,7,16],[6,17,7,17],[6,18,7,18],[6,19,7,19],[6,20,7,20],[6,21,7,21],[6,22,7,22],[7,0,8,0],[7,1,8,1],[7,2,8,5],[7,6,8,8],[8,9,9,9],[8,10,9,10],[8,11,9,11],[8,12,9,12],[8,13,9,13],[8,14,9,14],[8,15,9,15],[8,23,9,27],[8,28,9,28],[8,29,9,29],[9,0,10,0],[9,1,10,1],[9,2,10,5],[9,6,10,8],[10,9,11,13],[10,14,11,14],[10,15,11,15],[10,23,11,23],[10,24,11,24],[10,25,11,25],[10,26,11,26],[10,27,11,27],[10,28,11,28],[10,29,11,29],[11,0,12,0],[11,1,12,1],[11,2,12,5],[11,6,12,8],[12,9,13,9],[12,10,13,10],[12,11,13,11],[12,12,13,12],[12,13,13,13],[12,14,13,14],[12,15,13,15],[12,16,13,20],[12,21,13,21],[12,22,13,22],[13,0,14,0],[13,1,14,1],[13,2,14,5],[13,6,14,8],[14,9,15,13],[14,14,15,14],[14,15,15,15],[14,16,15,16],[14,17,15,17],[14,18,15,18],[14,19,15,19],[14,20,15,20],[14,21,15,21],[14,22,15,22],[15,0,16,0],[15,1,16,1],[15,2,16,5],[15,6,16,8],[16,9,17,9],[16,10,17,10],[16,11,17,11],[16,12,17,12],[16,13,17,13],[16,14,17,14],[16,15,17,15],[17,0,18,0],[17,1,18,1],[17,2,18,5],[17,6,18,8],[17,30,18,34],[17,35,18,35],[17,36,18,36],[18,9,19,13],[18,14,19,14],[18,15,19,15],[19,0,20,0],[19,1,20,1],[19,2,20,5],[19,6,20,8],[19,30,20,30],[19,31,20,31],[19,32,20,32],[19,33,20,33],[19,34,20,34],[19,35,20,35],[19,36,20,36],[20,9,21,9],[20,10,21,10],[20,11,21,11],[20,12,21,12],[20,13,21,13],[20,14,21,14],[20,15,21,15],[20,16,21,20],[20,21,21,21],[20,22,21,22],[21,0,22,0],[21,1,22,1],[21,2,22,5],[21,6,22,8],[22,9,23,13],[22,14,23,14],[22,15,23,15],[22,16,23,16],[22,17,23,17],[22,18,23,18],[22,19,23,19],[22,20,23,20],[22,21,23,21],[22,22,23,22],[23,0,24,0],[23,1,24,1],[23,2,24,5],[23,6,24,8],[24,9,25,9],[24,10,25,10],[24,11,25,11],[24,12,25,12],[24,13,25,13],[24,14,25,14],[24,15,25,15],[24,23,25,27],[24,28,25,28],[24,29,25,29],[25,0,26,0],[25,1,26,1],[25,2,26,5],[25,6,26,8],[26,9,27,13],[26,14,27,14],[26,15,27,15],[26,23,27,23],[26,24,27,24],[26,25,27,25],[26,26,27,26],[26,27,27,27],[26,28,27,28],[26,29,27,29],[27,0,28,0],[27,1,28,1],[27,2,28,5],[27,6,28,8],[28,9,29,9],[28,10,29,10],[28,11,29,11],[28,12,29,12],[28,13,29,13],[28,14,29,14],[28,15,29,15],[28,16,29,20],[28,21,29,21],[28,22,29,22],[29,0,30,0],[29,1,30,1],[29,2,30,5],[29,6,30,8],[30,9,31,13],[30,14,31,14],[30,15,31,15],[30,16,31,16],[30,17,31,17],[30,18,31,18],[30,19,31,19],[30,20,31,20],[30,21,31,21],[30,22,31,22],[31,0,32,0],[31,1,32,1],[31,2,32,5],[31,6,32,8],[32,9,33,9],[32,10,33,10],[32,11,33,11],[32,12,33,12],[32,13,33,13],[32,14,33,14],[32,15,33,15],[33,0,34,0],[33,1,34,1],[33,2,34,5],[33,6,34,8],[33,30,34,34],[33,35,34,35],[33,36,34,36],[34,9,35,13],[34,14,35,14],[34,15,35,15],[35,0,36,0],[35,1,36,1],[35,2,36,5],[35,6,36,8],[35,30,36,30],[35,31,36,31],[35,32,36,32],[35,33,36,33],[35,34,36,34],[35,35,36,35],[35,36,36,36],[36,9,37,9],[36,10,37,10],[36,11,37,11],[36,12,37,12],[36,13,37,13],[36,14,37,14],[36,15,37,15],[36,16,37,20],[36,21,37,21],[36,22,37,22],[37,0,38,0],[37,1,38,1],[37,2,38,5],[37,6,38,8],[38,9,39,13],[38,14,39,14],[38,15,39,15],[38,16,39,16],[38,17,39,17],[38,18,39,18],[38,19,39,19],[38,20,39,20],[38,21,39,21],[38,22,39,22],[39,0,40,0],[39,1,40,1],[39,2,40,5],[39,6,40,8],[40,9,41,9],[40,10,41,10],[40,11,41,11],[40,12,41,12],[40,13,41,13],[40,14,41,14],[40,15,41,15],[40,23,41,27],[40,28,41,28],[40,29,41,29],[41,0,42,0],[41,1,42,1],[41,2,42,5],[41,6,42,8],[42,9,43,13],[42,14,43,14],[42,15,43,15],[42,23,43,23],[42,24,43,24],[42,25,43,25],[42,26,43,26],[42,27,43,27],[42,28,43,28],[42,29,43,29],[43,0,44,0],[43,1,44,1],[43,2,44,5],[43,6,44,8],[44,9,45,9],[44,10,45,10],[44,11,45,11],[44,12,45,12],[44,13,45,13],[44,14,45,14],[44,15,45,15],[44,16,45,20],[44,21,45,21],[44,22,45,22],[45,0,46,0],[45,1,46,1],[45,2,46,5],[45,6,46,8],[46,9,47,13],[46,14,47,14],[46,15,47,15],[46,16,47,16],[46,17,47,17],[46,18,47,18],[46,19,47,19],[46,20,47,20],[46,21,47,21],[46,22,47,22],[47,0,48,0],[47,1,48,1],[47,2,48,5],[47,6,48,8],[48,9,49,9],[48,10,49,10],[48,11,49,11],[48,12,49,12],[48,13,49,13],[48,14,49,14],[48,15,49,15],[49,0,50,0],[49,1,50,1],[49,2,50,5],[49,6,50,8],[49,30,50,34],[49,35,50,35],[49,36,50,36],[50,9,51,13],[50,14,51,14],[50,15,51,15],[51,0,52,0],[51,1,52,1],[51,2,52,5],[51,6,52,8],[51,30,52,30],[51,31,52,31],[51,32,52,32],[51,33,52,33],[51,34,52,34],[51,35,52,35],[51,36,52,36],[52,9,53,9],[52,10,53,10],[52,11,53,11],[52,12,53,12],[52,13,53,13],[52,14,53,14],[52,15,53,15],[52,16,53,20],[52,21,53,21],[52,22,53,22],[53,0,54,0],[53,1,54,1],[53,2,54,5],[53,6,54,8],[54,9,55,13],[54,14,55,14],[54,15,55,15],[54,16,55,16],[54,17,55,17],[54,18,55,18],[54,19,55,19],[54,20,55,20],[54,21,55,21],[54,22,55,22],[55,0,56,0],[55,1,56,1],[55,2,56,5],[55,6,56,8],[56,9,57,9],[56,10,57,10],[56,11,57,11],[56,12,57,12],[56,13,57,13],[56,14,57,14],[56,15,57,15],[56,23,57,27],[56,28,57,28],[56,29,57,29],[56,32,57,34],[56,35,57,37],[57,0,58,0],[57,1,58,1],[57,2,58,5],[57,6,58,8],[58,9,59,13],[58,14,59,14],[58,15,59,15],[58,23,59,23],[58,24,59,24],[58,25,59,25],[58,26,59,26],[58,27,59,27],[58,28,59,28],[58,29,59,29],[59,0,60,0],[59,1,60,1],[59,2,60,5],[59,6,60,8],[60,9,61,9],[60,10,61,10],[60,11,61,11],[60,12,61,12],[60,13,61,13],[60,14,61,14],[60,15,61,15],[60,16,61,20],[60,21,61,21],[60,22,61,22],[61,0,62,0],[61,1,62,1],[61,2,62,5],[61,6,62,8],[62,9,63,13],[62,14,63,14],[62,15,63,15],[62,16,63,16],[62,17,63,17],[62,18,63,18],[62,19,63,19],[62,20,63,20],[62,21,63,21],[62,22,63,22],[63,0,64,0],[63,1,64,1],[63,2,64,5],[63,6,64,8],[64,9,65,9],[64,10,65,10],[64,11,65,11],[64,12,65,12],[64,13,65,13],[64,14,65,14],[64,15,65,15],[67,2,67,5],[67,6,67,8],[67,9,68,13],[67,14,68,14],[67,15,68,15],[68,0,69,0],[68,1,69,1],[68,2,69,5],[68,6,69,8],[69,9,70,9],[69,10,70,10],[69,11,70,11],[69,12,70,12],[69,13,70,13],[69,14,70,14],[69,15,70,15],[69,16,70,20],[69,21,70,21],[69,22,70,22],[70,0,71,0],[70,1,71,1],[70,2,71,5],[70,6,71,8],[71,9,72,13],[71,14,72,14],[71,15,72,15],[71,16,72,16],[71,17,72,17],[71,18,72,18],[71,19,72,19],[71,20,72,20],[71,21,72,21],[71,22,72,22],[72,0,73,0],[72,1,73,1],[72,2,73,5],[72,6,73,8],[73,9,74,9],[73,10,74,10],[73,11,74,11],[73,12,74,12],[73,13,74,13],[73,14,74,14],[73,15,74,15],[73,23,74,27],[73,28,74,28],[73,29,74,29],[74,0,75,0],[74,1,75,1],[74,2,75,5],[74,6,75,8],[75,9,76,13],[75,14,76,14],[75,15,76,15],[75,23,76,23],[75,24,76,24],[75,25,76,25],[75,26,76,26],[75,27,76,27],[75,28,76,28],[75,29,76,29],[76,0,77,0],[76,1,77,1],[76,2,77,5],[76,6,77,8],[77,9,78,9],[77,10,78,10],[77,11,78,11],[77,12,78,12],[77,13,78,13],[77,14,78,14],[77,15,78,15],[77,16,78,20],[77,21,78,21],[77,22,78,22],[78,0,79,0],[78,1,79,1],[78,2,79,5],[78,6,79,8],[79,9,80,13],[79,14,80,14],[79,15,80,15],[79,16,80,16],[79,17,80,17],[79,18,80,18],[79,19,80,19],[79,20,80,20],[79,21,80,21],[79,22,80,22],[80,0,81,0],[80,1,81,1],[80,2,81,5],[80,6,81,8],[81,9,82,9],[81,10,82,10],[81,11,82,11],[81,12,82,12],[81,13,82,13],[81,14,82,14],[81,15,82,15],[82,0,83,0],[82,1,83,1],[82,2,83,5],[82,6,83,8],[82,30,83,34],[82,35,83,35],[82,36,83,36],[83,9,84,13],[83,14,84,14],[83,15,84,15],[84,0,85,0],[84,1,85,1],[84,2,85,5],[84,6,85,8],[84,30,85,30],[84,31,85,31],[84,32,85,32],[84,33,85,33],[84,34,85,34],[84,35,85,35],[84,36,85,36],[85,9,86,9],[85,10,86,10],[85,11,86,11],[85,12,86,12],[85,13,86,13],[85,14,86,14],[85,15,86,15],[85,16,86,20],[85,21,86,21],[85,22,86,22],[86,0,87,0],[86,1,87,1],[86,2,87,5],[86,6,87,8],[87,9,88,13],[87,14,88,14],[87,15,88,15],[87,16,88,16],[87,17,88,17],[87,18,88,18],[87,19,88,19],[87,20,88,20],[87,21,88,21],[87,22,88,22],[88,0,89,0],[88,1,89,1],[88,2,89,5],[88,6,89,8],[89,9,90,9],[89,10,90,10],[89,11,90,11],[89,12,90,12],[89,13,90,13],[89,14,90,14],[89,15,90,15],[89,23,90,27],[89,28,90,28],[89,29,90,29],[90,0,91,0],[90,1,91,1],[90,2,91,5],[90,6,91,8],[91,9,92,13],[91,14,92,14],[91,15,92,15],[91,23,92,23],[91,24,92,24],[91,25,92,25],[91,26,92,26],[91,27,92,27],[91,28,92,28],[91,29,92,29],[92,0,93,0],[92,1,93,1],[92,2,93,5],[92,6,93,8],[93,9,94,9],[93,10,94,10],[93,11,94,11],[93,12,94,12],[93,13,94,13],[93,14,94,14],[93,15,94,15],[93,16,94,20],[93,21,94,21],[93,22,94,22],[94,0,95,0],[94,1,95,1],[94,2,95,5],[94,6,95,8],[95,9,96,13],[95,14,96,14],[95,15,96,15],[95,16,96,16],[95,17,96,17],[95,18,96,18],[95,19,96,19],[95,20,96,20],[95,21,96,21],[95,22,96,22],[96,0,97,0],[96,1,97,1],[96,2,97,5],[96,6,97,8],[97,9,98,9],[97,10,98,10],[97,11,98,11],[97,12,98,12],[97,13,98,13],[97,14,98,14],[97,15,98,15],[98,0,99,0],[98,1,99,1],[98,2,99,5],[98,6,99,8],[98,30,99,34],[98,35,99,35],[98,36,99,36],[99,9,100,13],[99,14,100,14],[99,15,100,15],[100,0,101,0],[100,1,101,1],[100,2,101,5],[100,6,101,8],[100,30,101,30],[100,31,101,31],[100,32,101,32],[100,33,101,33],[100,34,101,34],[100,35,101,35],[100,36,101,36],[101,9,102,9],[101,10,102,10],[101,11,102,11],[101,12,102,12],[101,13,102,13],[101,14,102,14],[101,15,102,15],[101,16,102,20],[101,21,102,21],[101,22,102,22],[102,0,103,0],[102,1,103,1],[102,2,103,5],[102,6,103,8],[103,9,104,13],[103,14,104,14],[103,15,104,15],[103,16,104,16],[103,17,104,17],[103,18,104,18],[103,19,104,19],[103,20,104,20],[103,21,104,21],[103,22,104,22],[104,0,105,0],[104,1,105,1],[104,2,105,5],[104,6,105,8],[105,9,106,9],[105,10,106,10],[105,11,106,11],[105,12,106,12],[105,13,106,13],[105,14,106,14],[105,15,106,15],[105,23,106,27],[105,28,106,28],[105,29,106,29],[106,0,107,0],[106,1,107,1],[106,2,107,5],[106,6,107,8],[107,9,108,13],[107,14,108,14],[107,15,108,15],[107,23,108,23],[107,24,108,24],[107,25,108,25],[107,26,108,26],[107,27,108,27],[107,28,108,28],[107,29,108,29],[108,0,109,0],[108,1,109,1],[108,2,109,5],[108,6,109,8],[109,9,110,9],[109,10,110,10],[109,11,110,11],[109,12,110,12],[109,13,110,13],[109,14,110,14],[109,15,110,15],[109,16,110,20],[109,21,110,21],[109,22,110,22],[110,0,111,0],[110,1,111,1],[110,2,111,5],[110,6,111,8],[111,9,112,13],[111,14,112,14],[111,15,112,15],[111,16,112,16],[111,17,112,17],[111,18,112,18],[111,19,112,19],[111,20,112,20],[111,21,112,21],[111,22,112,22],[112,0,113,0],[112,1,113,1],[112,2,113,5],[112,6,113,8],[113,9,114,9],[113,10,114,10],[113,11,114,11],[113,12,114,12],[113,13,114,13],[113,14,114,14],[113,15,114,15],[114,0,115,0],[114,1,115,1],[114,2,115,5],[114,6,115,8],[114,30,115,34],[114,35,115,35],[114,36,115,36],[115,9,116,13],[115,14,116,14],[115,15,116,15],[116,0,117,0],[116,1,117,1],[116,2,117,5],[116,6,117,8],[116,30,117,30],[116,31,117,31],[116,32,117,32],[116,33,117,33],[116,34,117,34],[116,35,117,35],[116,36,117,36],[117,9,118,9],[117,10,118,10],[117,11,118,11],[117,12,118,12],[117,13,118,13],[117,14,118,14],[117,15,118,15],[117,16,118,20],[117,21,118,21],[117,22,118,22],[118,0,119,0],[118,1,119,1],[118,2,119,5],[118,6,119,8],[119,9,120,13],[119,14,120,14],[119,15,120,15],[119,16,120,16],[119,17,120,17],[119,18,120,18],[119,19,120,19],[119,20,120,20],[119,21,120,21],[119,22,120,22],[120,0,121,0],[120,1,121,1],[120,2,121,5],[120,6,121,8],[121,9,122,9],[121,10,122,10],[121,11,122,11],[121,12,122,12],[121,13,122,13],[121,14,122,14],[121,15,122,15],[121,23,122,27],[121,28,122,28],[121,29,122,29],[121,32,122,34],[121,35,122,37],[122,0,123,0],[122,1,123,1],[122,2,123,5],[122,6,123,8],[123,9,124,13],[123,14,124,14],[123,15,124,15],[123,23,124,23],[123,24,124,24],[123,25,124,25],[123,26,124,26],[123,27,124,27],[123,28,124,28],[123,29,124,29],[123,32,124,34],[123,35,124,37],[124,0,125,0],[124,1,125,1],[124,2,125,5],[124,6,125,8],[125,9,126,9],[125,10,126,10],[125,11,126,11],[125,12,126,12],[125,13,126,13],[125,14,126,14],[125,15,126,15],[125,16,126,20],[125,21,126,21],[125,22,126,22],[125,32,126,34],[125,35,126,37],[126,0,127,0],[126,1,127,1],[126,2,127,5],[126,6,127,8],[127,9,128,13],[127,14,128,14],[127,15,128,15],[127,16,128,16],[127,17,128,17],[127,18,128,18],[127,19,128,19],[127,20,128,20],[127,21,128,21],[127,22,128,22],[127,32,128,34],[127,35,128,37],[128,0,129,0],[128,1,129,1],[128,2,129,5],[128,6,129,8],[129,9,130,9],[129,10,130,10],[129,11,130,11],[129,12,130,12],[129,13,130,13],[129,14,130,14],[129,15,130,15]]}
[{"$f":"info!C3","v":"Otvoreno prvenstvo RSTSN"},{"$nulls":36},{"$f":"info!C4","v":"mlađi kadeti"}]
[]
[1,1,{"$f":"IF(ISNA(MATCH(A3,spisak!$E$4:$E$199,0)),IF(ISNA(MATCH(A3,plasman!$I$3:$I$68,0)),\"bye\",INDEX(plasman!$H$3:$H$68,MATCH(A3,plasman!$I$3:$I$68,0))),INDEX(spisak!$B$4:$B$199,MATCH(A3,spisak!$E$4:$E$199,0)))","v":"Ilić Bogdan"},{"$nulls":3},{"$f":"IF(ISNA(MATCH(C3,spisak!$B$4:$B$199,0)),\"\",INDEX(spisak!$C$4:$C$199,MATCH(C3,spisak!$B$4:$B$199,0)))","v":"Napad"},null,null,{"$f":"partije!$S$200","v":"Ilić Bogdan"},{"$nulls":4},{"$f":"IF(ISBLANK(partije!J200),\"\",IF(partije!J200>partije!K200,partije!J200,partije!K200))","v":3},{"$f":"IF(ISBLANK(partije!J200),\"\",IF(partije!J200>partije!K200,partije!K200,partije!J200))","v":0},{"$nulls":5},"finale:",null,null,{"$f":"IF(AE99=\"bye\",\"\",AE34)","v":""},{"$nulls":5},{"$f":"IF(AE99=\"bye\",\"\",partije!S262)","v":""},{"$nulls":4},{"$f":"IF(ISBLANK(partije!J262),\"\",IF(partije!J262>partije!K262,partije!J262,partije!K262))","v":""},{"$f":"IF(ISBLANK(partije!J262),\"\",IF(partije!J262>partije!K262,partije!K262,partije!J262))","v":""}]
[2,null,{"$f":"IF(ISNA(MATCH(A4,spisak!$E$4:$E$199,0)),IF(ISNA(MATCH(A4,plasman!$I$3:$I$68,0)),\"bye\",INDEX(plasman!$H$3:$H$68,MATCH(A4,plasman!$I$3:$I$68,0))),INDEX(spisak!$B$4:$B$199,MATCH(A4,spisak!$E$4:$E$199,0)))","v":"Putnik Dario"},{"$nulls":3},{"$f":"IF(ISNA(MATCH(C4,spisak!$B$4:$B$199,0)),\"\",INDEX(spisak!$C$4:$C$199,MATCH(C4,spisak!$B$4:$B$199,0)))","v":"Milenijum"},{"$nulls":17},{"$f":"IF(AE99=\"bye\",\"\",AE99)","v":""}]
[null,null,{"$f":"IF(ISNA(MATCH(A5,spisak!$E$4:$E$199,0)),IF(ISNA(MATCH(A5,plasman!$I$3:$I$68,0)),\"bye\",INDEX(plasman!$H$3:$H$68,MATCH(A5,plasman!$I$3:$I$68,0))),INDEX(spisak!$B$4:$B$199,MATCH(A5,spisak!$E$4:$E$199,0)))","v":0},{"$nulls":3},{"$f":"IF(ISNA(MATCH(C5,spisak!$B$4:$B$199,0)),\"\",INDEX(spisak!$C$4:$C$199,MATCH(C5,spisak!$B$4:$B$199,0)))","v":""},null,null,{"$f":"IF(ISBLANK(partije!L200),\"\",partije!L200)","v":{"v":1103,"d":"11-03"}},{"$f":"IF(ISBLANK(partije!M200),\"\",partije!M200)","v":{"v":1104,"d":"11-04"}},{"$f":"IF(ISBLANK(partije!N200),\"\",partije!N200)","v":{"v":1107,"d":"11-07"}},{"$f":"IF(ISBLANK(partije!O200),\"\",partije!O200)","v":""},{"$f":"IF(ISBLANK(partije!P200),\"\",partije!P200)","v":""},{"$f":"IF(ISBLANK(partije!Q200),\"\",partije!Q200)","v":""},{"$f":"IF(ISBLANK(partije!R200),\"\",partije!R200)","v":""},{"$f":"partije!$S$216","v":"Ilić Bogdan"},{"$nulls":4},{"$f":"IF(ISBLANK(partije!J216),\"\",IF(partije!J216>partije!K216,partije!J216,partije!K216))","v":3},{"$f":"IF(ISBLANK(partije!J216),\"\",IF(partije!J216>partije!K216,partije!K216,partije!J216))","v":0},{"$nulls":7},{"$f":"IF(ISBLANK(partije!L262),\"\",partije!L262)","v":""},{"$f":"IF(ISBLANK(partije!M262),\"\",partije!M262)","v":""},{"$f":"IF(ISBLANK(partije!N262),\"\",partije!N262)","v":""},{"$f":"IF(ISBLANK(partije!O262),\"\",partije!O262)","v":""},{"$f":"IF(ISBLANK(partije!P262),\"\",partije!P262)","v":""},{"$f":"IF(ISBLANK(partije!Q262),\"\",partije!Q262)","v":""},{"$f":"IF(ISBLANK(partije!R262),\"\",partije!R262)","v":""}]
[3,null,{"$f":"IF(ISNA(MATCH(A6,spisak!$E$4:$E$199,0)),IF(ISNA(MATCH(A6,plasman!$I$3:$I$68,0)),\"bye\",INDEX(plasman!$H$3:$H$68,MATCH(A6,plasman!$I$3:$I$68,0))),INDEX(spisak!$B$4:$B$199,MATCH(A6,spisak!$E$4:$E$199,0)))","v":"Pavković Đorđe"},{"$nulls":3},{"$f":"IF(ISNA(MATCH(C6,spisak!$B$4:$B$199,0)),\"\",INDEX(spisak!$C$4:$C$199,MATCH(C6,spisak!$B$4:$B$199,0)))","v":"Ozren Sokobanja"}]
[null,null,{"$f":"IF(ISNA(MATCH(A7,spisak!$E$4:$E$199,0)),IF(ISNA(MATCH(A7,plasman!$I$3:$I$68,0)),\"bye\",INDEX(plasman!$H$3:$H$68,MATCH(A7,plasman!$I$3:$I$68,0))),INDEX(spisak!$B$4:$B$199,MATCH(A7,spisak!$E$4:$E$199,0)))","v":0},{"$nulls":3},{"$f":"IF(ISNA(MATCH(C7,spisak!$B$4:$B$199,0)),\"\",INDEX(spisak!$C$4:$C$199,MATCH(C7,spisak!$B$4:$B$199,0)))","v":""},null,null,{"$f":"partije!S201","v":"Pavković Đorđe"},{"$nulls":4},{"$f":"IF(ISBLANK(partije!J201),\"\",IF(partije!J201>partije!K201,partije!J201,partije!K201))","v":3},{"$f":"IF(ISBLANK(partije!J201),\"\",IF(partije!J201>partije!K201,partije!K201,partije!J201))","v":2},{"$f":"IF(ISBLANK(partije!L216),\"\",partije!L216)","v":{"v":1104,"d":"11-04"}},{"$f":"IF(ISBLANK(partije!M216),\"\",partije!M216)","v":{"v":1105,"d":"11-05"}},{"$f":"IF(ISBLANK(partije!N216),\"\",partije!N216)","v":{"v":1210,"d":"12-10"}},{"$f":"IF(ISBLANK(partije!O216),\"\",partije!O216)","v":""},{"$f":"IF(ISBLANK(partije!P216),\"\",partije!P216)","v":""},{"$f":"IF(ISBLANK(partije!Q216),\"\",partije!Q216)","v":""},{"$f":"IF(ISBLANK(partije!R216),\"\",partije!R216)","v":""}]
[4,16,{"$f":"IF(ISNA(MATCH(A8,spisak!$E$4:$E$199,0)),IF(ISNA(MATCH(A8,plasman!$I$3:$I$68,0)),\"bye\",INDEX(plasman!$H$3:$H$68,MATCH(A8,plasman!$I$3:$I$68,0))),INDEX(spisak!$B$4:$B$199,MATCH(A8,spisak!$E$4:$E$199,0)))","v":"Rajić Borislav"},{"$nulls":3},{"$f":"IF(ISNA(MATCH(C8,spisak!$B$4:$B$199,0)),\"\",INDEX(spisak!$C$4:$C$199,MATCH(C8,spisak!$B$4:$B$199,0)))","v":"Novi Sad"}]
[null,16,{"$f":"IF(ISNA(MATCH(A9,spisak!$E$4:$E$199,0)),IF(ISNA(MATCH(A9,plasman!$I$3:$I$68,0)),\"bye\",INDEX(plasman!$H$3:$H$68,MATCH(A9,plasman!$I$3:$I$68,0))),INDEX(spisak!$B$4:$B$199,MATCH(A9,spisak!$E$4:$E$199,0)))","v":0},{"$nulls":3},{"$f":"IF(ISNA(MATCH(C9,spisak!$B$4:$B$199,0)),\"\",INDEX(spisak!$C$4:$C$199,MATCH(C9,spisak!$B$4:$B$199,0)))","v":""},null,null,{"$f":"IF(ISBLANK(partije!L201),\"\",partije!L201)","v":{"v":1107,"d":"11-07"}},{"$f":"IF(ISBLANK(partije!M201),\"\",partije!M201)","v":{"v":811,"d":"08-11"}},{"$f":"IF(ISBLANK(partije!N201),\"\",partije!N201)","v":{"v":1109,"d":"11-09"}},{"$f":"IF(ISBLANK(partije!O201),\"\",partije!O201)","v":{"v":511,"d":"05-11"}},{"$f":"IF(ISBLANK(partije!P201),\"\",partije!P201)","v":{"v":1311,"d":"13-11"}},{"$f":"IF(ISBLANK(partije!Q201),\"\",partije!Q201)","v":""},{"$f":"IF(ISBLANK(partije!R201),\"\",partije!R201)","v":""},{"$nulls":7},{"$f":"partije!$S$224","v":"Pavlović Dimitrije"},{"$nulls":4},{"$f":"IF(ISBLANK(partije!J224),\"\",IF(partije!J224>partije!K224,partije!J224,partije!K224))","v":3},{"$f":"IF(ISBLANK(partije!J224),\"\",IF(partije!J224>partije!K224,partije!K224,partije!J224))","v":1}]
[5,9,{"$f":"IF(ISNA(MATCH(A10,spisak!$E$4:$E$199,0)),IF(ISNA(MATCH(A10,plasman!$I$3:$I$68,0)),\"bye\",INDEX(plasman!$H$3:$H$68,MATCH(A10,plasman!$I$3:$I$68,0))),INDEX(spisak!$B$4:$B$199,MATCH(A10,spisak!$E$4:$E$199,0)))","v":"Miljuš Luka"},{"$nulls":3},{"$f":"IF(ISNA(MATCH(C10,spisak!$B$4:$B$199,0)),\"\",INDEX(spisak!$C$4:$C$199,MATCH(C10,spisak!$B$4:$B$199,0)))","v":"Vojvodina  Novi Sad"}]
[null,9,{"$f":"IF(ISNA(MATCH(A11,spisak!$E$4:$E$199,0)),IF(ISNA(MATCH(A11,plasman!$I$3:$I$68,0)),\"bye\",INDEX(plasman!$H$3:$H$68,MATCH(A11,plasman!$I$3:$I$68,0))),INDEX(spisak!$B$4:$B$199,MATCH(A11,spisak!$E$4:$E$199,0)))","v":0},{"$nulls":3},{"$f":"IF(ISNA(MATCH(C11,spisak!$B$4:$B$199,0)),\"\",INDEX(spisak!$C$4:$C$199,MATCH(C11,spisak!$B$4:$B$199,0)))","v":""},null,null,{"$f":"partije!S202","v":"Miljuš Luka"},{"$nulls":4},{"$f":"IF(ISBLANK(partije!J202),\"\",IF(partije!J202>partije!K202,partije!J202,partije!K202))","v":3},{"$f":"IF(ISBLANK(partije!J202),\"\",IF(partije!J202>partije!K202,partije!K202,partije!J202))","v":1},{"$nulls":7},{"$f":"IF(ISBLANK(partije!L224),\"\",partije!L224)","v":{"v":1109,"d":"11-09"}},{"$f":"IF(ISBLANK(partije!M224),\"\",partije!M224)","v":{"v":811,"d":"08-11"}},{"$f":"IF(ISBLANK(partije!N224),\"\",partije!N224)","v":{"v":711,"d":"07-11"}},{"$f":"IF(ISBLANK(partije!O224),\"\",partije!O224)","v":{"v":811,"d":"08-11"}},{"$f":"IF(ISBLANK(partije!P224),\"\",partije!P224)","v":""},{"$f":"IF(ISBLANK(partije!Q224),\"\",partije!Q224)","v":""},{"$f":"IF(ISBLANK(partije!R224),\"\",partije!R224)","v":""}]
[6,null,{"$f":"IF(ISNA(MATCH(A12,spisak!$E$4:$E$199,0)),IF(ISNA(MATCH(A12,plasman!$I$3:$I$68,0)),\"bye\",INDEX(plasman!$H$3:$H$68,MATCH(A12,plasman!$I$3:$I$68,0))),INDEX(spisak!$B$4:$B$199,MATCH(A12,spisak!$E$4:$E$199,0)))","v":"Stefanović Luka"},{"$nulls":3},{"$f":"IF(ISNA(MATCH(C12,spisak!$B$4:$B$199,0)),\"\",INDEX(spisak!$C$4:$C$199,MATCH(C12,spisak!$B$4:$B$199,0)))","v":"Novi Sad"}]
[null,null,{"$f":"IF(ISNA(MATCH(A13,spisak!$E$4:$E$199,0)),IF(ISNA(MATCH(A13,plasman!$I$3:$I$68,0)),\"bye\",INDEX(plasman!$H$3:$H$68,MATCH(A13,plasman!$I$3:$I$68,0))),INDEX(spisak!$B$4:$B$199,MATCH(A13,spisak!$E$4:$E$199,0)))","v":0},{"$nulls":3},{"$f":"IF(ISNA(MATCH(C13,spisak!$B$4:$B$199,0)),\"\",INDEX(spisak!$C$4:$C$199,MATCH(C13,spisak!$B$4:$B$199,0)))","v":""},null,null,{"$f":"IF(ISBLANK(partije!L202),\"\",partije!L202)","v":{"v":811,"d":"08-11"}},{"$f":"IF(ISBLANK(partije!M202),\"\",partije!M202)","v":{"v":1106,"d":"11-06"}},{"$f":"IF(ISBLANK(partije!N202),\"\",partije!N202)","v":{"v":1108,"d":"11-08"}},{"$f":"IF(ISBLANK(partije!O202),\"\",partije!O202)","v":{"v":1102,"d":"11-02"}},{"$f":"IF(ISBLANK(partije!P202),\"\",partije!P202)","v":""},{"$f":"IF(ISBLANK(partije!Q202),\"\",partije!Q202)","v":""},{"$f":"IF(ISBLANK(partije!R202),\"\",partije!R202)","v":""},{"$f":"partije!$S$217","v":"Pavlović Dimitrije"},{"$nulls":4},{"$f":"IF(ISBLANK(partije!J217),\"\",IF(partije!J217>partije!K217,partije!J217,partije!K217))","v":3},{"$f":"IF(ISBLANK(partije!J217),\"\",IF(partije!J217>partije!K217,partije!K217,partije!J217))","v":1}]
[7,null,{"$f":"IF(ISNA(MATCH(A14,spisak!$E$4:$E$199,0)),IF(ISNA(MATCH(A14,plasman!$I$3:$I$68,0)),\"bye\",INDEX(plasman!$H$3:$H$68,MATCH(A14,plasman!$I$3:$I$68,0))),INDEX(spisak!$B$4:$B$199,MATCH(A14,spisak!$E$4:$E$199,0)))","v":"Vasić Bogdan"},{"$nulls":3},{"$f":"IF(ISNA(MATCH(C14,spisak!$B$4:$B$199,0)),\"\",INDEX(spisak!$C$4:$C$199,MATCH(C14,spisak!$B$4:$B$199,0)))","v":"Stoni"}]
[null,null,{"$f":"IF(ISNA(MATCH(A15,spisak!$E$4:$E$199,0)),IF(ISNA(MATCH(A15,plasman!$I$3:$I$68,0)),\"bye\",INDEX(plasman!$H$3:$H$68,MATCH(A15,plasman!$I$3:$I$68,0))),INDEX(spisak!$B$4:$B$199,MATCH(A15,spisak!$E$4:$E$199,0)))","v":0},{"$nulls":3},{"$f":"IF(ISNA(MATCH(C15,spisak!$B$4:$B$199,0)),\"\",INDEX(spisak!$C$4:$C$199,MATCH(C15,spisak!$B$4:$B$199,0)))","v":""},null,null,{"$f":"partije!$S$203","v":"Pavlović Dimitrije"},{"$nulls":4},{"$f":"IF(ISBLANK(partije!J203),\"\",IF(partije!J203>partije!K203,partije!J203,partije!K203))","v":3},{"$f":"IF(ISBLANK(partije!J203),\"\",IF(partije!J203>partije!K203,partije!K203,partije!J203))","v":0},{"$f":"IF(ISBLANK(partije!L217),\"\",partije!L217)","v":""},{"$f":"IF(ISBLANK(partije!M217),\"\",partije!M217)","v":""},{"$f":"IF(ISBLANK(partije!N217),\"\",partije!N217)","v":""},{"$f":"IF(ISBLANK(partije!O217),\"\",partije!O217)","v":""},{"$f":"IF(ISBLANK(partije!P217),\"\",partije!P217)","v":""},{"$f":"IF(ISBLANK(partije!Q217),\"\",partije!Q217)","v":""},{"$f":"IF(ISBLANK(partije!R217),\"\",partije!R217)","v":""}]
[8,8,{"$f":"IF(ISNA(MATCH(A16,spisak!$E$4:$E$199,0)),IF(ISNA(MATCH(A16,plasman!$I$3:$I$68,0)),\"bye\",INDEX(plasman!$H$3:$H$68,MATCH(A16,plasman!$I$3:$I$68,0))),INDEX(spisak!$B$4:$B$199,MATCH(A16,spisak!$E$4:$E$199,0)))","v":"Pavlović Dimitrije"},{"$nulls":3},{"$f":"IF(ISNA(MATCH(C16,spisak!$B$4:$B$199,0)),\"\",INDEX(spisak!$C$4:$C$199,MATCH(C16,spisak!$B$4:$B$199,0)))","v":"Stak Zemun"}]
[null,8,{"$f":"IF(ISNA(MATCH(A17,spisak!$E$4:$E$199,0)),IF(ISNA(MATCH(A17,plasman!$I$3:$I$68,0)),\"bye\",INDEX(plasman!$H$3:$H$68,MATCH(A17,plasman!$I$3:$I$68,0))),INDEX(spisak!$B$4:$B$199,MATCH(A17,spisak!$E$4:$E$199,0)))","v":0},{"$nulls":3},{"$f":"IF(ISNA(MATCH(C17,spisak!$B$4:$B$199,0)),\"\",INDEX(spisak!$C$4:$C$199,MATCH(C17,spisak!$B$4:$B$199,0)))","v":""},null,null,{"$f":"IF(ISBLANK(partije!L203),\"\",partije!L203)","v":{"v":811,"d":"08-11"}},{"$f":"IF(ISBLANK(partije!M203),\"\",partije!M203)","v":{"v":911,"d":"09-11"}},{"$f":"IF(ISBLANK(partije!N203),\"\",partije!N203)","v":{"v":311,"d":"03-11"}},{"$f":"IF(ISBLANK(partije!O203),\"\",partije!O203)","v":""},{"$f":"IF(ISBLANK(partije!P203),\"\",partije!P203)","v":""},{"$f":"IF(ISBLANK(partije!Q203),\"\",partije!Q203)","v":""},{"$f":"IF(ISBLANK(partije!R203),\"\",partije!R203)","v":""}]
[9,5,{"$f":"IF(ISNA(MATCH(A18,spisak!$E$4:$E$199,0)),IF(ISNA(MATCH(A18,plasman!$I$3:$I$68,0)),\"bye\",INDEX(plasman!$H$3:$H$68,MATCH(A18,plasman!$I$3:$I$68,0))),INDEX(spisak!$B$4:$B$199,MATCH(A18,spisak!$E$4:$E$199,0)))","v":"Varga Danijel"},{"$nulls":3},{"$f":"IF(ISNA(MATCH(C18,spisak!$B$4:$B$199,0)),\"\",INDEX(spisak!$C$4:$C$199,MATCH(C18,spisak!$B$4:$B$199,0)))","v":"Temerin"},{"$nulls":23},{"$f":"partije!$S$228","v":"Pavlović Dušan"},{"$nulls":4},{"$f":"IF(ISBLANK(partije!J228),\"\",IF(partije!J228>partije!K228,partije!J228,partije!K228))","v":3},{"$f":"IF(ISBLANK(partije!J228),\"\",IF(partije!J228>partije!K228,partije!K228,partije!J228))","v":0}]
[null,5,{"$f":"IF(ISNA(MATCH(A19,spisak!$E$4:$E$199,0)),IF(ISNA(MATCH(A19,plasman!$I$3:$I$68,0)),\"bye\",INDEX(plasman!$H$3:$H$68,MATCH(A19,plasman!$I$3:$I$68,0))),INDEX(spisak!$B$4:$B$199,MATCH(A19,spisak!$E$4:$E$199,0)))","v":0},{"$nulls":3},{"$f":"IF(ISNA(MATCH(C19,spisak!$B$4:$B$199,0)),\"\",INDEX(spisak!$C$4:$C$199,MATCH(C19,spisak!$B$4:$B$199,0)))","v":""},null,null,{"$f":"partije!$S$204","v":"Varga Danijel"},{"$nulls":4},{"$f":"IF(ISBLANK(partije!J204),\"\",IF(partije!J204>partije!K204,partije!J204,partije!K204))","v":3},{"$f":"IF(ISBLANK(partije!J204),\"\",IF(partije!J204>partije!K204,partije!K204,partije!J204))","v":1}]
[10,null,{"$f":"IF(ISNA(MATCH(A20,spisak!$E$4:$E$199,0)),IF(ISNA(MATCH(A20,plasman!$I$3:$I$68,0)),\"bye\",INDEX(plasman!$H$3:$H$68,MATCH(A20,plasman!$I$3:$I$68,0))),INDEX(spisak!$B$4:$B$199,MATCH(A20,spisak!$E$4:$E$199,0)))","v":"Marković Jovan"},{"$nulls":3},{"$f":"IF(ISNA(MATCH(C20,spisak!$B$4:$B$199,0)),\"\",INDEX(spisak!$C$4:$C$199,MATCH(C20,spisak!$B$4:$B$199,0)))","v":"Vojvodina  Novi Sad"},{"$nulls":23},{"$f":"IF(ISBLANK(partije!L228),\"\",partije!L228)","v":{"v":811,"d":"08-11"}},{"$f":"IF(ISBLANK(partije!M228),\"\",partije!M228)","v":{"v":711,"d":"07-11"}},{"$f":"IF(ISBLANK(partije!N228),\"\",partije!N228)","v":{"v":311,"d":"03-11"}},{"$f":"IF(ISBLANK(partije!O228),\"\",partije!O228)","v":""},{"$f":"IF(ISBLANK(partije!P228),\"\",partije!P228)","v":""},{"$f":"IF(ISBLANK(partije!Q228),\"\",partije!Q228)","v":""},{"$f":"IF(ISBLANK(partije!R228),\"\",partije!R228)","v":""}]
[null,null,{"$f":"IF(ISNA(MATCH(A21,spisak!$E$4:$E$199,0)),IF(ISNA(MATCH(A21,plasman!$I$3:$I$68,0)),\"bye\",INDEX(plasman!$H$3:$H$68,MATCH(A21,plasman!$I$3:$I$68,0))),INDEX(spisak!$B$4:$B$199,MATCH(A21,spisak!$E$4:$E$199,0)))","v":0},{"$nulls":3},{"$f":"IF(ISNA(MATCH(C21,spisak!$B$4:$B$199,0)),\"\",INDEX(spisak!$C$4:$C$199,MATCH(C21,spisak!$B$4:$B$199,0)))","v":""},null,null,{"$f":"IF(ISBLANK(partije!L204),\"\",partije!L204)","v":{"v":1103,"d":"11-03"}},{"$f":"IF(ISBLANK(partije!M204),\"\",partije!M204)","v":{"v":811,"d":"08-11"}},{"$f":"IF(ISBLANK(partije!N204),\"\",partije!N204)","v":{"v":1109,"d":"11-09"}},{"$f":"IF(ISBLANK(partije!O204),\"\",partije!O204)","v":{"v":1104,"d":"11-04"}},{"$f":"IF(ISBLANK(partije!P204),\"\",partije!P204)","v":""},{"$f":"IF(ISBLANK(partije!Q204),\"\",partije!Q204)","v":""},{"$f":"IF(ISBLANK(partije!R204),\"\",partije!R204)","v":""},{"$f":"partije!$S$218","v":"Ninković Uroš"},{"$nulls":4},{"$f":"IF(ISBLANK(partije!J218),\"\",IF(partije!J218>partije!K218,partije!J218,partije!K218))","v":3},{"$f":"IF(ISBLANK(partije!J218),\"\",IF(partije!J218>partije!K218,partije!K218,partije!J218))","v":1}]
[11,null,{"$f":"IF(ISNA(MATCH(A22,spisak!$E$4:$E$199,0)),IF(ISNA(MATCH(A22,plasman!$I$3:$I$68,0)),\"bye\",INDEX(plasman!$H$3:$H$68,MATCH(A22,plasman!$I$3:$I$68,0))),INDEX(spisak!$B$4:$B$199,MATCH(A22,spisak!$E$4:$E$199,0)))","v":"Kalinčević Vladimir"},{"$nulls":3},{"$f":"IF(ISNA(MATCH(C22,spisak!$B$4:$B$199,0)),\"\",INDEX(spisak!$C$4:$C$199,MATCH(C22,spisak!$B$4:$B$199,0)))","v":"Sinđelić Beograd"}]
[null,null,{"$f":"IF(ISNA(MATCH(A23,spisak!$E$4:$E$199,0)),IF(ISNA(MATCH(A23,plasman!$I$3:$I$68,0)),\"bye\",INDEX(plasman!$H$3:$H$68,MATCH(A23,plasman!$I$3:$I$68,0))),INDEX(spisak!$B$4:$B$199,MATCH(A23,spisak!$E$4:$E$199,0)))","v":0},{"$nulls":3},{"$f":"IF(ISNA(MATCH(C23,spisak!$B$4:$B$199,0)),\"\",INDEX(spisak!$C$4:$C$199,MATCH(C23,spisak!$B$4:$B$199,0)))","v":""},null,null,{"$f":"partije!$S$205","v":"Ninković Uroš"},{"$nulls":4},{"$f":"IF(ISBLANK(partije!J205),\"\",IF(partije!J205>partije!K205,partije!J205,partije!K205))","v":3},{"$f":"IF(ISBLANK(partije!J205),\"\",IF(partije!J205>partije!K205,partije!K205,partije!J205))","v":0},{"$f":"IF(ISBLANK(partije!L218),\"\",partije!L218)","v":{"v":1012,"d":"10-12"}},{"$f":"IF(ISBLANK(partije!M218),\"\",partije!M218)","v":{"v":1106,"d":"11-06"}},{"$f":"IF(ISBLANK(partije!N218),\"\",partije!N218)","v":{"v":811,"d":"08-11"}},{"$f":"IF(ISBLANK(partije!O218),\"\",partije!O218)","v":{"v":511,"d":"05-11"}},{"$f":"IF(ISBLANK(partije!P218),\"\",partije!P218)","v":""},{"$f":"IF(ISBLANK(partije!Q218),\"\",partije!Q218)","v":""},{"$f":"IF(ISBLANK(partije!X218),\"\",partije!X218)","v":""}]
[12,12,{"$f":"IF(ISNA(MATCH(A24,spisak!$E$4:$E$199,0)),IF(ISNA(MATCH(A24,plasman!$I$3:$I$68,0)),\"bye\",INDEX(plasman!$H$3:$H$68,MATCH(A24,plasman!$I$3:$I$68,0))),INDEX(spisak!$B$4:$B$199,MATCH(A24,spisak!$E$4:$E$199,0)))","v":"Ninković Uroš"},{"$nulls":3},{"$f":"IF(ISNA(MATCH(C24,spisak!$B$4:$B$199,0)),\"\",INDEX(spisak!$C$4:$C$199,MATCH(C24,spisak!$B$4:$B$199,0)))","v":"Stak Zemun"}]
[null,12,{"$f":"IF(ISNA(MATCH(A25,spisak!$E$4:$E$199,0)),IF(ISNA(MATCH(A25,plasman!$I$3:$I$68,0)),\"bye\",INDEX(plasman!$H$3:$H$68,MATCH(A25,plasman!$I$3:$I$68,0))),INDEX(spisak!$B$4:$B$199,MATCH(A25,spisak!$E$4:$E$199,0)))","v":0},{"$nulls":3},{"$f":"IF(ISNA(MATCH(C25,spisak!$B$4:$B$199,0)),\"\",INDEX(spisak!$C$4:$C$199,MATCH(C25,spisak!$B$4:$B$199,0)))","v":""},null,null,{"$f":"IF(ISBLANK(partije!L205),\"\",partije!L205)","v":{"v":711,"d":"07-11"}},{"$f":"IF(ISBLANK(partije!M205),\"\",partije!M205)","v":{"v":511,"d":"05-11"}},{"$f":"IF(ISBLANK(partije!N205),\"\",partije!N205)","v":{"v":711,"d":"07-11"}},{"$f":"IF(ISBLANK(partije!O205),\"\",partije!O205)","v":""},{"$f":"IF(ISBLANK(partije!P205),\"\",partije!P205)","v":""},{"$f":"IF(ISBLANK(partije!Q205),\"\",partije!Q205)","v":""},{"$f":"IF(ISBLANK(partije!R205),\"\",partije!R205)","v":""},{"$nulls":7},{"$f":"partije!$S$225","v":"Pavlović Dušan"},{"$nulls":4},{"$f":"IF(ISBLANK(partije!J225),\"\",IF(partije!J225>partije!K225,partije!J225,partije!K225))","v":3},{"$f":"IF(ISBLANK(partije!J225),\"\",IF(partije!J225>partije!K225,partije!K225,partije!J225))","v":0}]
[13,13,{"$f":"IF(ISNA(MATCH(A26,spisak!$E$4:$E$199,0)),IF(ISNA(MATCH(A26,plasman!$I$3:$I$68,0)),\"bye\",INDEX(plasman!$H$3:$H$68,MATCH(A26,plasman!$I$3:$I$68,0))),INDEX(spisak!$B$4:$B$199,MATCH(A26,spisak!$E$4:$E$199,0)))","v":"Paunović Petar"},{"$nulls":3},{"$f":"IF(ISNA(MATCH(C26,spisak!$B$4:$B$199,0)),\"\",INDEX(spisak!$C$4:$C$199,MATCH(C26,spisak!$B$4:$B$199,0)))","v":"Stoni"}]
[null,13,{"$f":"IF(ISNA(MATCH(A27,spisak!$E$4:$E$199,0)),IF(ISNA(MATCH(A27,plasman!$I$3:$I$68,0)),\"bye\",INDEX(plasman!$H$3:$H$68,MATCH(A27,plasman!$I$3:$I$68,0))),INDEX(spisak!$B$4:$B$199,MATCH(A27,spisak!$E$4:$E$199,0)))","v":0},{"$nulls":3},{"$f":"IF(ISNA(MATCH(C27,spisak!$B$4:$B$199,0)),\"\",INDEX(spisak!$C$4:$C$199,MATCH(C27,spisak!$B$4:$B$199,0)))","v":""},null,null,{"$f":"partije!$S$206","v":"Paunović Petar"},{"$nulls":4},{"$f":"IF(ISBLANK(partije!J206),\"\",IF(partije!J206>partije!K206,partije!J206,partije!K206))","v":3},{"$f":"IF(ISBLANK(partije!J206),\"\",IF(partije!J206>partije!K206,partije!K206,partije!J206))","v":0},{"$nulls":7},{"$f":"IF(ISBLANK(partije!L225),\"\",partije!L225)","v":{"v":311,"d":"03-11"}},{"$f":"IF(ISBLANK(partije!M225),\"\",partije!M225)","v":{"v":711,"d":"07-11"}},{"$f":"IF(ISBLANK(partije!N225),\"\",partije!N225)","v":{"v":511,"d":"05-11"}},{"$f":"IF(ISBLANK(partije!O225),\"\",partije!O225)","v":""},{"$f":"IF(ISBLANK(partije!P225),\"\",partije!P225)","v":""},{"$f":"IF(ISBLANK(partije!Q225),\"\",partije!Q225)","v":""},{"$f":"IF(ISBLANK(partije!R225),\"\",partije!R225)","v":""}]
[14,null,{"$f":"IF(ISNA(MATCH(A28,spisak!$E$4:$E$199,0)),IF(ISNA(MATCH(A28,plasman!$I$3:$I$68,0)),\"bye\",INDEX(plasman!$H$3:$H$68,MATCH(A28,plasman!$I$3:$I$68,0))),INDEX(spisak!$B$4:$B$199,MATCH(A28,spisak!$E$4:$E$199,0)))","v":"Mladenović Ognjen"},{"$nulls":3},{"$f":"IF(ISNA(MATCH(C28,spisak!$B$4:$B$199,0)),\"\",INDEX(spisak!$C$4:$C$199,MATCH(C28,spisak!$B$4:$B$199,0)))","v":"Prva Petoletka"}]
[null,null,{"$f":"IF(ISNA(MATCH(A29,spisak!$E$4:$E$199,0)),IF(ISNA(MATCH(A29,plasman!$I$3:$I$68,0)),\"bye\",INDEX(plasman!$H$3:$H$68,MATCH(A29,plasman!$I$3:$I$68,0))),INDEX(spisak!$B$4:$B$199,MATCH(A29,spisak!$E$4:$E$199,0)))","v":0},{"$nulls":3},{"$f":"IF(ISNA(MATCH(C29,spisak!$B$4:$B$199,0)),\"\",INDEX(spisak!$C$4:$C$199,MATCH(C29,spisak!$B$4:$B$199,0)))","v":""},null,null,{"$f":"IF(ISBLANK(partije!L206),\"\",partije!L206)","v":{"v":1108,"d":"11-08"}},{"$f":"IF(ISBLANK(partije!M206),\"\",partije!M206)","v":{"v":1102,"d":"11-02"}},{"$f":"IF(ISBLANK(partije!N206),\"\",partije!N206)","v":{"v":1107,"d":"11-07"}},{"$f":"IF(ISBLANK(partije!O206),\"\",partije!O206)","v":""},{"$f":"IF(ISBLANK(partije!P206),\"\",partije!P206)","v":""},{"$f":"IF(ISBLANK(partije!Q206),\"\",partije!Q206)","v":""},{"$f":"IF(ISBLANK(partije!R206),\"\",partije!R206)","v":""},{"$f":"partije!$S$219","v":"Pavlović Dušan"},{"$nulls":4},{"$f":"IF(ISBLANK(partije!J219),\"\",IF(partije!J219>partije!K219,partije!J219,partije!K219))","v":3},{"$f":"IF(ISBLANK(partije!J219),\"\",IF(partije!J219>partije!K219,partije!K219,partije!J219))","v":0}]
[15,null,{"$f":"IF(ISNA(MATCH(A30,spisak!$E$4:$E$199,0)),IF(ISNA(MATCH(A30,plasman!$I$3:$I$68,0)),\"bye\",INDEX(plasman!$H$3:$H$68,MATCH(A30,plasman!$I$3:$I$68,0))),INDEX(spisak!$B$4:$B$199,MATCH(A30,spisak!$E$4:$E$199,0)))","v":"Velinović Miloš"},{"$nulls":3},{"$f":"IF(ISNA(MATCH(C30,spisak!$B$4:$B$199,0)),\"\",INDEX(spisak!$C$4:$C$199,MATCH(C30,spisak!$B$4:$B$199,0)))","v":"Belo Polje"}]
[null,null,{"$f":"IF(ISNA(MATCH(A31,spisak!$E$4:$E$199,0)),IF(ISNA(MATCH(A31,plasman!$I$3:$I$68,0)),\"bye\",INDEX(plasman!$H$3:$H$68,MATCH(A31,plasman!$I$3:$I$68,0))),INDEX(spisak!$B$4:$B$199,MATCH(A31,spisak!$E$4:$E$199,0)))","v":0},{"$nulls":3},{"$f":"IF(ISNA(MATCH(C31,spisak!$B$4:$B$199,0)),\"\",INDEX(spisak!$C$4:$C$199,MATCH(C31,spisak!$B$4:$B$199,0)))","v":""},null,null,{"$f":"partije!$S$207","v":"Pavlović Dušan"},{"$nulls":4},{"$f":"IF(ISBLANK(partije!J207),\"\",IF(partije!J207>partije!K207,partije!J207,partije!K207))","v":3},{"$f":"IF(ISBLANK(partije!J207),\"\",IF(partije!J207>partije!K207,partije!K207,partije!J207))","v":0},{"$f":"IF(ISBLANK(partije!L219),\"\",partije!L219)","v":{"v":311,"d":"03-11"}},{"$f":"IF(ISBLANK(partije!M219),\"\",partije!M219)","v":{"v":611,"d":"06-11"}},{"$f":"IF(ISBLANK(partije!N219),\"\",partije!N219)","v":{"v":811,"d":"08-11"}},{"$f":"IF(ISBLANK(partije!O219),\"\",partije!O219)","v":""},{"$f":"IF(ISBLANK(partije!P219),\"\",partije!P219)","v":""},{"$f":"IF(ISBLANK(partije!Q219),\"\",partije!Q219)","v":""},{"$f":"IF(ISBLANK(partije!R219),\"\",partije!R219)","v":""}]
[16,4,{"$f":"IF(ISNA(MATCH(A32,spisak!$E$4:$E$199,0)),IF(ISNA(MATCH(A32,plasman!$I$3:$I$68,0)),\"bye\",INDEX(plasman!$H$3:$H$68,MATCH(A32,plasman!$I$3:$I$68,0))),INDEX(spisak!$B$4:$B$199,MATCH(A32,spisak!$E$4:$E$199,0)))","v":"Pavlović Dušan"},{"$nulls":3},{"$f":"IF(ISNA(MATCH(C32,spisak!$B$4:$B$199,0)),\"\",INDEX(spisak!$C$4:$C$199,MATCH(C32,spisak!$B$4:$B$199,0)))","v":"Stak Zemun"}]
[null,4,{"$f":"IF(ISNA(MATCH(A33,spisak!$E$4:$E$199,0)),IF(ISNA(MATCH(A33,plasman!$I$3:$I$68,0)),\"bye\",INDEX(plasman!$H$3:$H$68,MATCH(A33,plasman!$I$3:$I$68,0))),INDEX(spisak!$B$4:$B$199,MATCH(A33,spisak!$E$4:$E$199,0)))","v":0},{"$nulls":3},{"$f":"IF(ISNA(MATCH(C33,spisak!$B$4:$B$199,0)),\"\",INDEX(spisak!$C$4:$C$199,MATCH(C33,spisak!$B$4:$B$199,0)))","v":""},null,null,{"$f":"IF(ISBLANK(partije!L207),\"\",partije!L207)","v":{"v":511,"d":"05-11"}},{"$f":"IF(ISBLANK(partije!M207),\"\",partije!M207)","v":{"v":411,"d":"04-11"}},{"$f":"IF(ISBLANK(partije!N207),\"\",partije!N207)","v":{"v":311,"d":"03-11"}},{"$f":"IF(ISBLANK(partije!O207),\"\",partije!O207)","v":""},{"$f":"IF(ISBLANK(partije!P207),\"\",partije!P207)","v":""},{"$f":"IF(ISBLANK(partije!Q207),\"\",partije!Q207)","v":""},{"$f":"IF(ISBLANK(partije!R207),\"\",partije!R207)","v":""}]
[17,3,{"$f":"IF(ISNA(MATCH(A34,spisak!$E$4:$E$199,0)),IF(ISNA(MATCH(A34,plasman!$I$3:$I$68,0)),\"bye\",INDEX(plasman!$H$3:$H$68,MATCH(A34,plasman!$I$3:$I$68,0))),INDEX(spisak!$B$4:$B$199,MATCH(A34,spisak!$E$4:$E$199,0)))","v":"Stefanović Vanja"},{"$nulls":3},{"$f":"IF(ISNA(MATCH(C34,spisak!$B$4:$B$199,0)),\"\",INDEX(spisak!$C$4:$C$199,MATCH(C34,spisak!$B$4:$B$199,0)))","v":"Stak Zemun"},{"$nulls":23},{"$f":"partije!$S$230","v":"Jelikić Dimitrije"},{"$nulls":4},{"$f":"IF(ISBLANK(partije!J230),\"\",IF(partije!J230>partije!K230,partije!J230,partije!K230))","v":3},{"$f":"IF(ISBLANK(partije!$J$230),\"\",IF(partije!$J$230>partije!$K$230,partije!$K$230,partije!$J$230))","v":2}]
[null,3,{"$f":"IF(ISNA(MATCH(A35,spisak!$E$4:$E$199,0)),IF(ISNA(MATCH(A35,plasman!$I$3:$I$68,0)),\"bye\",INDEX(plasman!$H$3:$H$68,MATCH(A35,plasman!$I$3:$I$68,0))),INDEX(spisak!$B$4:$B$199,MATCH(A35,spisak!$E$4:$E$199,0)))","v":0},{"$nulls":3},{"$f":"IF(ISNA(MATCH(C35,spisak!$B$4:$B$199,0)),\"\",INDEX(spisak!$C$4:$C$199,MATCH(C35,spisak!$B$4:$B$199,0)))","v":""},null,null,{"$f":"partije!$S$208","v":"Stefanović Vanja"},{"$nulls":4},{"$f":"IF(ISBLANK(partije!J208),\"\",IF(partije!J208>partije!K208,partije!J208,partije!K208))","v":3},{"$f":"IF(ISBLANK(partije!J208),\"\",IF(partije!J208>partije!K208,partije!K208,partije!J208))","v":0}]
[18,null,{"$f":"IF(ISNA(MATCH(A36,spisak!$E$4:$E$199,0)),IF(ISNA(MATCH(A36,plasman!$I$3:$I$68,0)),\"bye\",INDEX(plasman!$H$3:$H$68,MATCH(A36,plasman!$I$3:$I$68,0))),INDEX(spisak!$B$4:$B$199,MATCH(A36,spisak!$E$4:$E$199,0)))","v":"Preslav Nikolov"},{"$nulls":3},{"$f":"IF(ISNA(MATCH(C36,spisak!$B$4:$B$199,0)),\"\",INDEX(spisak!$C$4:$C$199,MATCH(C36,spisak!$B$4:$B$199,0)))","v":"Bdinci Bugarska"},{"$nulls":23},{"$f":"IF(ISBLANK(partije!L230),\"\",partije!L230)","v":{"v":1106,"d":"11-06"}},{"$f":"IF(ISBLANK(partije!M230),\"\",partije!M230)","v":{"v":711,"d":"07-11"}},{"$f":"IF(ISBLANK(partije!N230),\"\",partije!N230)","v":{"v":811,"d":"08-11"}},{"$f":"IF(ISBLANK(partije!O230),\"\",partije!O230)","v":{"v":1106,"d":"11-06"}},{"$f":"IF(ISBLANK(partije!P230),\"\",partije!P230)","v":{"v":811,"d":"08-11"}},{"$f":"IF(ISBLANK(partije!Q230),\"\",partije!Q230)","v":""},{"$f":"IF(ISBLANK(partije!R230),\"\",partije!R230)","v":""}]
[null,null,{"$f":"IF(ISNA(MATCH(A37,spisak!$E$4:$E$199,0)),IF(ISNA(MATCH(A37,plasman!$I$3:$I$68,0)),\"bye\",INDEX(plasman!$H$3:$H$68,MATCH(A37,plasman!$I$3:$I$68,0))),INDEX(spisak!$B$4:$B$199,MATCH(A37,spisak!$E$4:$E$199,0)))","v":0},{"$nulls":3},{"$f":"IF(ISNA(MATCH(C37,spisak!$B$4:$B$199,0)),\"\",INDEX(spisak!$C$4:$C$199,MATCH(C37,spisak!$B$4:$B$199,0)))","v":""},null,null,{"$f":"IF(ISBLANK(partije!L208),\"\",partije!L208)","v":{"v":1106,"d":"11-06"}},{"$f":"IF(ISBLANK(partije!M208),\"\",partije!M208)","v":{"v":1108,"d":"11-08"}},{"$f":"IF(ISBLANK(partije!N208),\"\",partije!N208)","v":{"v":1101,"d":"11-01"}},{"$f":"IF(ISBLANK(partije!O208),\"\",partije!O208)","v":""},{"$f":"IF(ISBLANK(partije!P208),\"\",partije!P208)","v":""},{"$f":"IF(ISBLANK(partije!Q208),\"\",partije!Q208)","v":""},{"$f":"IF(ISBLANK(partije!R208),\"\",partije!R208)","v":""},{"$f":"partije!$S$220","v":"Stefanović Vanja"},{"$nulls":4},{"$f":"IF(ISBLANK(partije!J220),\"\",IF(partije!J220>partije!K220,partije!J220,partije!K220))","v":3},{"$f":"IF(ISBLANK(partije!J220),\"\",IF(partije!J220>partije!K220,partije!K220,partije!J220))","v":1}]
[19,null,{"$f":"IF(ISNA(MATCH(A38,spisak!$E$4:$E$199,0)),IF(ISNA(MATCH(A38,plasman!$I$3:$I$68,0)),\"bye\",INDEX(plasman!$H$3:$H$68,MATCH(A38,plasman!$I$3:$I$68,0))),INDEX(spisak!$B$4:$B$199,MATCH(A38,spisak!$E$4:$E$199,0)))","v":"Dragin Saša"},{"$nulls":3},{"$f":"IF(ISNA(MATCH(C38,spisak!$B$4:$B$199,0)),\"\",INDEX(spisak!$C$4:$C$199,MATCH(C38,spisak!$B$4:$B$199,0)))","v":"Borac Čačak"}]
[null,null,{"$f":"IF(ISNA(MATCH(A39,spisak!$E$4:$E$199,0)),IF(ISNA(MATCH(A39,plasman!$I$3:$I$68,0)),\"bye\",INDEX(plasman!$H$3:$H$68,MATCH(A39,plasman!$I$3:$I$68,0))),INDEX(spisak!$B$4:$B$199,MATCH(A39,spisak!$E$4:$E$199,0)))","v":0},{"$nulls":3},{"$f":"IF(ISNA(MATCH(C39,spisak!$B$4:$B$199,0)),\"\",INDEX(spisak!$C$4:$C$199,MATCH(C39,spisak!$B$4:$B$199,0)))","v":""},null,null,{"$f":"partije!$S$209","v":"Radonjić Stefan"},{"$nulls":4},{"$f":"IF(ISBLANK(partije!J209),\"\",IF(partije!J209>partije!K209,partije!J209,partije!K209))","v":3},{"$f":"IF(ISBLANK(partije!J209),\"\",IF(partije!J209>partije!K209,partije!K209,partije!J209))","v":0},{"$f":"IF(ISBLANK(partije!L220),\"\",partije!L220)","v":{"v":711,"d":"07-11"}},{"$f":"IF(ISBLANK(partije!M220),\"\",partije!M220)","v":{"v":1105,"d":"11-05"}},{"$f":"IF(ISBLANK(partije!N220),\"\",partije!N220)","v":{"v":1106,"d":"11-06"}},{"$f":"IF(ISBLANK(partije!O220),\"\",partije!O220)","v":{"v":1105,"d":"11-05"}},{"$f":"IF(ISBLANK(partije!P220),\"\",partije!P220)","v":""},{"$f":"IF(ISBLANK(partije!Q220),\"\",partije!Q220)","v":""},{"$f":"IF(ISBLANK(partije!R220),\"\",partije!R220)","v":""}]
[20,14,{"$f":"IF(ISNA(MATCH(A40,spisak!$E$4:$E$199,0)),IF(ISNA(MATCH(A40,plasman!$I$3:$I$68,0)),\"bye\",INDEX(plasman!$H$3:$H$68,MATCH(A40,plasman!$I$3:$I$68,0))),INDEX(spisak!$B$4:$B$199,MATCH(A40,spisak!$E$4:$E$199,0)))","v":"Radonjić Stefan"},{"$nulls":3},{"$f":"IF(ISNA(MATCH(C40,spisak!$B$4:$B$199,0)),\"\",INDEX(spisak!$C$4:$C$199,MATCH(C40,spisak!$B$4:$B$199,0)))","v":"Milenijum"}]
[null,14,{"$f":"IF(ISNA(MATCH(A41,spisak!$E$4:$E$199,0)),IF(ISNA(MATCH(A41,plasman!$I$3:$I$68,0)),\"bye\",INDEX(plasman!$H$3:$H$68,MATCH(A41,plasman!$I$3:$I$68,0))),INDEX(spisak!$B$4:$B$199,MATCH(A41,spisak!$E$4:$E$199,0)))","v":0},{"$nulls":3},{"$f":"IF(ISNA(MATCH(C41,spisak!$B$4:$B$199,0)),\"\",INDEX(spisak!$C$4:$C$199,MATCH(C41,spisak!$B$4:$B$199,0)))","v":""},null,null,{"$f":"IF(ISBLANK(partije!L209),\"\",partije!L209)","v":{"v":611,"d":"06-11"}},{"$f":"IF(ISBLANK(partije!M209),\"\",partije!M209)","v":{"v":611,"d":"06-11"}},{"$f":"IF(ISBLANK(partije!N209),\"\",partije!N209)","v":{"v":511,"d":"05-11"}},{"$f":"IF(ISBLANK(partije!O209),\"\",partije!O209)","v":""},{"$f":"IF(ISBLANK(partije!P209),\"\",partije!P209)","v":""},{"$f":"IF(ISBLANK(partije!Q209),\"\",partije!Q209)","v":""},{"$f":"IF(ISBLANK(partije!R209),\"\",partije!R209)","v":""},{"$nulls":7},{"$f":"partije!$S$226","v":"Jelikić Dimitrije"},{"$nulls":4},{"$f":"IF(ISBLANK(partije!J226),\"\",IF(partije!J226>partije!K226,partije!J226,partije!K226))","v":3},{"$f":"IF(ISBLANK(partije!J226),\"\",IF(partije!J226>partije!K226,partije!K226,partije!J226))","v":2}]
[21,11,{"$f":"IF(ISNA(MATCH(A42,spisak!$E$4:$E$199,0)),IF(ISNA(MATCH(A42,plasman!$I$3:$I$68,0)),\"bye\",INDEX(plasman!$H$3:$H$68,MATCH(A42,plasman!$I$3:$I$68,0))),INDEX(spisak!$B$4:$B$199,MATCH(A42,spisak!$E$4:$E$199,0)))","v":"Jozić Marino"},{"$nulls":3},{"$f":"IF(ISNA(MATCH(C42,spisak!$B$4:$B$199,0)),\"\",INDEX(spisak!$C$4:$C$199,MATCH(C42,spisak!$B$4:$B$199,0)))","v":"Spartak"}]
[null,11,{"$f":"IF(ISNA(MATCH(A43,spisak!$E$4:$E$199,0)),IF(ISNA(MATCH(A43,plasman!$I$3:$I$68,0)),\"bye\",INDEX(plasman!$H$3:$H$68,MATCH(A43,plasman!$I$3:$I$68,0))),INDEX(spisak!$B$4:$B$199,MATCH(A43,spisak!$E$4:$E$199,0)))","v":0},{"$nulls":3},{"$f":"IF(ISNA(MATCH(C43,spisak!$B$4:$B$199,0)),\"\",INDEX(spisak!$C$4:$C$199,MATCH(C43,spisak!$B$4:$B$199,0)))","v":""},null,null,{"$f":"partije!$S$210","v":"Jozić Marino"},{"$nulls":4},{"$f":"IF(ISBLANK(partije!J210),\"\",IF(partije!J210>partije!K210,partije!J210,partije!K210))","v":3},{"$f":"IF(ISBLANK(partije!J210),\"\",IF(partije!J210>partije!K210,partije!K210,partije!J210))","v":0},{"$nulls":7},{"$f":"IF(ISBLANK(partije!L226),\"\",partije!L226)","v":{"v":511,"d":"05-11"}},{"$f":"IF(ISBLANK(partije!M226),\"\",partije!M226)","v":{"v":1107,"d":"11-07"}},{"$f":"IF(ISBLANK(partije!N226),\"\",partije!N226)","v":{"v":1106,"d":"11-06"}},{"$f":"IF(ISBLANK(partije!O226),\"\",partije!O226)","v":{"v":911,"d":"09-11"}},{"$f":"IF(ISBLANK(partije!P226),\"\",partije!P226)","v":{"v":711,"d":"07-11"}},{"$f":"IF(ISBLANK(partije!Q226),\"\",partije!Q226)","v":""},{"$f":"IF(ISBLANK(partije!R226),\"\",partije!R226)","v":""}]
[22,null,{"$f":"IF(ISNA(MATCH(A44,spisak!$E$4:$E$199,0)),IF(ISNA(MATCH(A44,plasman!$I$3:$I$68,0)),\"bye\",INDEX(plasman!$H$3:$H$68,MATCH(A44,plasman!$I$3:$I$68,0))),INDEX(spisak!$B$4:$B$199,MATCH(A44,spisak!$E$4:$E$199,0)))","v":"Zaharijev  Nikola"},{"$nulls":3},{"$f":"IF(ISNA(MATCH(C44,spisak!$B$4:$B$199,0)),\"\",INDEX(spisak!$C$4:$C$199,MATCH(C44,spisak!$B$4:$B$199,0)))","v":"Mladost Bosilegrad"}]
[null,null,{"$f":"IF(ISNA(MATCH(A45,spisak!$E$4:$E$199,0)),IF(ISNA(MATCH(A45,plasman!$I$3:$I$68,0)),\"bye\",INDEX(plasman!$H$3:$H$68,MATCH(A45,plasman!$I$3:$I$68,0))),INDEX(spisak!$B$4:$B$199,MATCH(A45,spisak!$E$4:$E$199,0)))","v":0},{"$nulls":3},{"$f":"IF(ISNA(MATCH(C45,spisak!$B$4:$B$199,0)),\"\",INDEX(spisak!$C$4:$C$199,MATCH(C45,spisak!$B$4:$B$199,0)))","v":""},null,null,{"$f":"IF(ISBLANK(partije!L210),\"\",partije!L210)","v":{"v":1103,"d":"11-03"}},{"$f":"IF(ISBLANK(partije!M210),\"\",partije!M210)","v":{"v":1105,"d":"11-05"}},{"$f":"IF(ISBLANK(partije!N210),\"\",partije!N210)","v":{"v":311,"d":"03-11"}},{"$f":"IF(ISBLANK(partije!O210),\"\",partije!O210)","v":{"v":1107,"d":"11-07"}},{"$f":"IF(ISBLANK(partije!P210),\"\",partije!P210)","v":""},{"$f":"IF(ISBLANK(partije!Q210),\"\",partije!Q210)","v":""},{"$f":"IF(ISBLANK(partije!R210),\"\",partije!R210)","v":""},{"$f":"partije!$S$221","v":"Jelikić Dimitrije"},{"$nulls":4},{"$f":"IF(ISBLANK(partije!J221),\"\",IF(partije!J221>partije!K221,partije!J221,partije!K221))","v":3},{"$f":"IF(ISBLANK(partije!J221),\"\",IF(partije!J221>partije!K221,partije!K221,partije!J221))","v":0}]
[23,null,{"$f":"IF(ISNA(MATCH(A46,spisak!$E$4:$E$199,0)),IF(ISNA(MATCH(A46,plasman!$I$3:$I$68,0)),\"bye\",INDEX(plasman!$H$3:$H$68,MATCH(A46,plasman!$I$3:$I$68,0))),INDEX(spisak!$B$4:$B$199,MATCH(A46,spisak!$E$4:$E$199,0)))","v":"Jovanović Đurađ"},{"$nulls":3},{"$f":"IF(ISNA(MATCH(C46,spisak!$B$4:$B$199,0)),\"\",INDEX(spisak!$C$4:$C$199,MATCH(C46,spisak!$B$4:$B$199,0)))","v":"Sinđelić Beograd"}]
[null,null,{"$f":"IF(ISNA(MATCH(A47,spisak!$E$4:$E$199,0)),IF(ISNA(MATCH(A47,plasman!$I$3:$I$68,0)),\"bye\",INDEX(plasman!$H$3:$H$68,MATCH(A47,plasman!$I$3:$I$68,0))),INDEX(spisak!$B$4:$B$199,MATCH(A47,spisak!$E$4:$E$199,0)))","v":0},{"$nulls":3},{"$f":"IF(ISNA(MATCH(C47,spisak!$B$4:$B$199,0)),\"\",INDEX(spisak!$C$4:$C$199,MATCH(C47,spisak!$B$4:$B$199,0)))","v":""},null,null,{"$f":"partije!$S$211","v":"Jelikić Dimitrije"},{"$nulls":4},{"$f":"IF(ISBLANK(partije!J211),\"\",IF(partije!J211>partije!K211,partije!J211,partije!K211))","v":3},{"$f":"IF(ISBLANK(partije!J211),\"\",IF(partije!J211>partije!K211,partije!K211,partije!J211))","v":0},{"$f":"IF(ISBLANK(partije!L221),\"\",partije!L221)","v":{"v":311,"d":"03-11"}},{"$f":"IF(ISBLANK(partije!M221),\"\",partije!M221)","v":{"v":711,"d":"07-11"}},{"$f":"IF(ISBLANK(partije!N221),\"\",partije!N221)","v":{"v":711,"d":"07-11"}},{"$f":"IF(ISBLANK(partije!O221),\"\",partije!O221)","v":""},{"$f":"IF(ISBLANK(partije!P221),\"\",partije!P221)","v":""},{"$f":"IF(ISBLANK(partije!Q221),\"\",partije!Q221)","v":""},{"$f":"IF(ISBLANK(partije!R221),\"\",partije!R221)","v":""}]
[24,6,{"$f":"IF(ISNA(MATCH(A48,spisak!$E$4:$E$199,0)),IF(ISNA(MATCH(A48,plasman!$I$3:$I$68,0)),\"bye\",INDEX(plasman!$H$3:$H$68,MATCH(A48,plasman!$I$3:$I$68,0))),INDEX(spisak!$B$4:$B$199,MATCH(A48,spisak!$E$4:$E$199,0)))","v":"Jelikić Dimitrije"},{"$nulls":3},{"$f":"IF(ISNA(MATCH(C48,spisak!$B$4:$B$199,0)),\"\",INDEX(spisak!$C$4:$C$199,MATCH(C48,spisak!$B$4:$B$199,0)))","v":"Crvena Zvezda Beograd"}]
[null,6,{"$f":"IF(ISNA(MATCH(A49,spisak!$E$4:$E$199,0)),IF(ISNA(MATCH(A49,plasman!$I$3:$I$68,0)),\"bye\",INDEX(plasman!$H$3:$H$68,MATCH(A49,plasman!$I$3:$I$68,0))),INDEX(spisak!$B$4:$B$199,MATCH(A49,spisak!$E$4:$E$199,0)))","v":0},{"$nulls":3},{"$f":"IF(ISNA(MATCH(C49,spisak!$B$4:$B$199,0)),\"\",INDEX(spisak!$C$4:$C$199,MATCH(C49,spisak!$B$4:$B$199,0)))","v":""},null,null,{"$f":"IF(ISBLANK(partije!L211),\"\",partije!L211)","v":{"v":211,"d":"02-11"}},{"$f":"IF(ISBLANK(partije!M211),\"\",partije!M211)","v":{"v":611,"d":"06-11"}},{"$f":"IF(ISBLANK(partije!N211),\"\",partije!N211)","v":{"v":611,"d":"06-11"}},{"$f":"IF(ISBLANK(partije!O211),\"\",partije!O211)","v":""},{"$f":"IF(ISBLANK(partije!P211),\"\",partije!P211)","v":""},{"$f":"IF(ISBLANK(partije!Q211),\"\",partije!Q211)","v":""},{"$f":"IF(ISBLANK(partije!R211),\"\",partije!R211)","v":""}]
[25,7,{"$f":"IF(ISNA(MATCH(A50,spisak!$E$4:$E$199,0)),IF(ISNA(MATCH(A50,plasman!$I$3:$I$68,0)),\"bye\",INDEX(plasman!$H$3:$H$68,MATCH(A50,plasman!$I$3:$I$68,0))),INDEX(spisak!$B$4:$B$199,MATCH(A50,spisak!$E$4:$E$199,0)))","v":"Bošković Marko"},{"$nulls":3},{"$f":"IF(ISNA(MATCH(C50,spisak!$B$4:$B$199,0)),\"\",INDEX(spisak!$C$4:$C$199,MATCH(C50,spisak!$B$4:$B$199,0)))","v":"Stak Zemun"},{"$nulls":23},{"$f":"partije!$S$229","v":"Jelikić Dimitrije"},{"$nulls":4},{"$f":"IF(ISBLANK(partije!J229),\"\",IF(partije!J229>partije!K229,partije!J229,partije!K229))","v":3},{"$f":"IF(ISBLANK(partije!J229),\"\",IF(partije!J229>partije!K229,partije!K229,partije!J229))","v":0}]
[null,7,{"$f":"IF(ISNA(MATCH(A51,spisak!$E$4:$E$199,0)),IF(ISNA(MATCH(A51,plasman!$I$3:$I$68,0)),\"bye\",INDEX(plasman!$H$3:$H$68,MATCH(A51,plasman!$I$3:$I$68,0))),INDEX(spisak!$B$4:$B$199,MATCH(A51,spisak!$E$4:$E$199,0)))","v":0},{"$nulls":3},{"$f":"IF(ISNA(MATCH(C51,spisak!$B$4:$B$199,0)),\"\",INDEX(spisak!$C$4:$C$199,MATCH(C51,spisak!$B$4:$B$199,0)))","v":""},null,null,{"$f":"partije!$S$212","v":"Bošković Marko"},{"$nulls":4},{"$f":"IF(ISBLANK(partije!J212),\"\",IF(partije!J212>partije!K212,partije!J212,partije!K212))","v":3},{"$f":"IF(ISBLANK(partije!J212),\"\",IF(partije!J212>partije!K212,partije!K212,partije!J212))","v":1}]
[26,null,{"$f":"IF(ISNA(MATCH(A52,spisak!$E$4:$E$199,0)),IF(ISNA(MATCH(A52,plasman!$I$3:$I$68,0)),\"bye\",INDEX(plasman!$H$3:$H$68,MATCH(A52,plasman!$I$3:$I$68,0))),INDEX(spisak!$B$4:$B$199,MATCH(A52,spisak!$E$4:$E$199,0)))","v":"Pucarević Pavle"},{"$nulls":3},{"$f":"IF(ISNA(MATCH(C52,spisak!$B$4:$B$199,0)),\"\",INDEX(spisak!$C$4:$C$199,MATCH(C52,spisak!$B$4:$B$199,0)))","v":"Hajduk Veljko"},{"$nulls":23},{"$f":"IF(ISBLANK(partije!L229),\"\",partije!L229)","v":{"v":1210,"d":"12-10"}},{"$f":"IF(ISBLANK(partije!M229),\"\",partije!M229)","v":{"v":1109,"d":"11-09"}},{"$f":"IF(ISBLANK(partije!N229),\"\",partije!N229)","v":{"v":1210,"d":"12-10"}},{"$f":"IF(ISBLANK(partije!O229),\"\",partije!O229)","v":""},{"$f":"IF(ISBLANK(partije!P229),\"\",partije!P229)","v":""},{"$f":"IF(ISBLANK(partije!Q229),\"\",partije!Q229)","v":""},{"$f":"IF(ISBLANK(partije!R229),\"\",partije!R229)","v":""}]
[null,null,{"$f":"IF(ISNA(MATCH(A53,spisak!$E$4:$E$199,0)),IF(ISNA(MATCH(A53,plasman!$I$3:$I$68,0)),\"bye\",INDEX(plasman!$H$3:$H$68,MATCH(A53,plasman!$I$3:$I$68,0))),INDEX(spisak!$B$4:$B$199,MATCH(A53,spisak!$E$4:$E$199,0)))","v":0},{"$nulls":3},{"$f":"IF(ISNA(MATCH(C53,spisak!$B$4:$B$199,0)),\"\",INDEX(spisak!$C$4:$C$199,MATCH(C53,spisak!$B$4:$B$199,0)))","v":""},null,null,{"$f":"IF(ISBLANK(partije!L212),\"\",partije!L212)","v":{"v":1109,"d":"11-09"}},{"$f":"IF(ISBLANK(partije!M212),\"\",partije!M212)","v":{"v":1109,"d":"11-09"}},{"$f":"IF(ISBLANK(partije!N212),\"\",partije!N212)","v":{"v":911,"d":"09-11"}},{"$f":"IF(ISBLANK(partije!O212),\"\",partije!O212)","v":{"v":1311,"d":"13-11"}},{"$f":"IF(ISBLANK(partije!P212),\"\",partije!P212)","v":""},{"$f":"IF(ISBLANK(partije!Q212),\"\",partije!Q212)","v":""},{"$f":"IF(ISBLANK(partije!R212),\"\",partije!R212)","v":""},{"$f":"partije!$S$222","v":"Bošković Marko"},{"$nulls":4},{"$f":"IF(ISBLANK(partije!J222),\"\",IF(partije!J222>partije!K222,partije!J222,partije!K222))","v":3},{"$f":"IF(ISBLANK(partije!J222),\"\",IF(partije!J222>partije!K222,partije!K222,partije!J222))","v":0}]
[27,null,{"$f":"IF(ISNA(MATCH(A54,spisak!$E$4:$E$199,0)),IF(ISNA(MATCH(A54,plasman!$I$3:$I$68,0)),\"bye\",INDEX(plasman!$H$3:$H$68,MATCH(A54,plasman!$I$3:$I$68,0))),INDEX(spisak!$B$4:$B$199,MATCH(A54,spisak!$E$4:$E$199,0)))","v":"Rajić Dalibor"},{"$nulls":3},{"$f":"IF(ISNA(MATCH(C54,spisak!$B$4:$B$199,0)),\"\",INDEX(spisak!$C$4:$C$199,MATCH(C54,spisak!$B$4:$B$199,0)))","v":"Novi Sad"}]
[null,null,{"$f":"IF(ISNA(MATCH(A55,spisak!$E$4:$E$199,0)),IF(ISNA(MATCH(A55,plasman!$I$3:$I$68,0)),\"bye\",INDEX(plasman!$H$3:$H$68,MATCH(A55,plasman!$I$3:$I$68,0))),INDEX(spisak!$B$4:$B$199,MATCH(A55,spisak!$E$4:$E$199,0)))","v":0},{"$nulls":3},{"$f":"IF(ISNA(MATCH(C55,spisak!$B$4:$B$199,0)),\"\",INDEX(spisak!$C$4:$C$199,MATCH(C55,spisak!$B$4:$B$199,0)))","v":""},null,null,{"$f":"partije!$S$213","v":"Rajić Dalibor"},{"$nulls":4},{"$f":"IF(ISBLANK(partije!J213),\"\",IF(partije!J213>partije!K213,partije!J213,partije!K213))","v":3},{"$f":"IF(ISBLANK(partije!J213),\"\",IF(partije!J213>partije!K213,partije!K213,partije!J213))","v":0},{"$f":"IF(ISBLANK(partije!L222),\"\",partije!L222)","v":{"v":1106,"d":"11-06"}},{"$f":"IF(ISBLANK(partije!M222),\"\",partije!M222)","v":{"v":1108,"d":"11-08"}},{"$f":"IF(ISBLANK(partije!N222),\"\",partije!N222)","v":{"v":1105,"d":"11-05"}},{"$f":"IF(ISBLANK(partije!O222),\"\",partije!O222)","v":""},{"$f":"IF(ISBLANK(partije!P222),\"\",partije!P222)","v":""},{"$f":"IF(ISBLANK(partije!Q222),\"\",partije!Q222)","v":""},{"$f":"IF(ISBLANK(partije!R222),\"\",partije!R222)","v":""}]
[28,10,{"$f":"IF(ISNA(MATCH(A56,spisak!$E$4:$E$199,0)),IF(ISNA(MATCH(A56,plasman!$I$3:$I$68,0)),\"bye\",INDEX(plasman!$H$3:$H$68,MATCH(A56,plasman!$I$3:$I$68,0))),INDEX(spisak!$B$4:$B$199,MATCH(A56,spisak!$E$4:$E$199,0)))","v":"Marinković Vasilije"},{"$nulls":3},{"$f":"IF(ISNA(MATCH(C56,spisak!$B$4:$B$199,0)),\"\",INDEX(spisak!$C$4:$C$199,MATCH(C56,spisak!$B$4:$B$199,0)))","v":"Barajevo"}]
[null,10,{"$f":"IF(ISNA(MATCH(A57,spisak!$E$4:$E$199,0)),IF(ISNA(MATCH(A57,plasman!$I$3:$I$68,0)),\"bye\",INDEX(plasman!$H$3:$H$68,MATCH(A57,plasman!$I$3:$I$68,0))),INDEX(spisak!$B$4:$B$199,MATCH(A57,spisak!$E$4:$E$199,0)))","v":0},{"$nulls":3},{"$f":"IF(ISNA(MATCH(C57,spisak!$B$4:$B$199,0)),\"\",INDEX(spisak!$C$4:$C$199,MATCH(C57,spisak!$B$4:$B$199,0)))","v":""},null,null,{"$f":"IF(ISBLANK(partije!L213),\"\",partije!L213)","v":{"v":1106,"d":"11-06"}},{"$f":"IF(ISBLANK(partije!M213),\"\",partije!M213)","v":{"v":1106,"d":"11-06"}},{"$f":"IF(ISBLANK(partije!N213),\"\",partije!N213)","v":{"v":1102,"d":"11-02"}},{"$f":"IF(ISBLANK(partije!O213),\"\",partije!O213)","v":""},{"$f":"IF(ISBLANK(partije!P213),\"\",partije!P213)","v":""},{"$f":"IF(ISBLANK(partije!Q213),\"\",partije!Q213)","v":""},{"$f":"IF(ISBLANK(partije!R213),\"\",partije!R213)","v":""},{"$nulls":7},{"$f":"partije!$S$227","v":"Šepa Matija"},{"$nulls":4},{"$f":"IF(ISBLANK(partije!J227),\"\",IF(partije!J227>partije!K227,partije!J227,partije!K227))","v":3},{"$f":"IF(ISBLANK(partije!J227),\"\",IF(partije!J227>partije!K227,partije!K227,partije!J227))","v":2}]
[29,15,{"$f":"IF(ISNA(MATCH(A58,spisak!$E$4:$E$199,0)),IF(ISNA(MATCH(A58,plasman!$I$3:$I$68,0)),\"bye\",INDEX(plasman!$H$3:$H$68,MATCH(A58,plasman!$I$3:$I$68,0))),INDEX(spisak!$B$4:$B$199,MATCH(A58,spisak!$E$4:$E$199,0)))","v":"Gerginov Vanja"},{"$nulls":3},{"$f":"IF(ISNA(MATCH(C58,spisak!$B$4:$B$199,0)),\"\",INDEX(spisak!$C$4:$C$199,MATCH(C58,spisak!$B$4:$B$199,0)))","v":"Novi Sad"}]
[null,15,{"$f":"IF(ISNA(MATCH(A59,spisak!$E$4:$E$199,0)),IF(ISNA(MATCH(A59,plasman!$I$3:$I$68,0)),\"bye\",INDEX(plasman!$H$3:$H$68,MATCH(A59,plasman!$I$3:$I$68,0))),INDEX(spisak!$B$4:$B$199,MATCH(A59,spisak!$E$4:$E$199,0)))","v":0},{"$nulls":3},{"$f":"IF(ISNA(MATCH(C59,spisak!$B$4:$B$199,0)),\"\",INDEX(spisak!$C$4:$C$199,MATCH(C59,spisak!$B$4:$B$199,0)))","v":""},null,null,{"$f":"partije!$S$214","v":"Gerginov Vanja"},{"$nulls":4},{"$f":"IF(ISBLANK(partije!J214),\"\",IF(partije!J214>partije!K214,partije!J214,partije!K214))","v":3},{"$f":"IF(ISBLANK(partije!J214),\"\",IF(partije!J214>partije!K214,partije!K214,partije!J214))","v":2},{"$nulls":7},{"$f":"IF(ISBLANK(partije!L227),\"\",partije!L227)","v":{"v":1109,"d":"11-09"}},{"$f":"IF(ISBLANK(partije!M227),\"\",partije!M227)","v":{"v":611,"d":"06-11"}},{"$f":"IF(ISBLANK(partije!N227),\"\",partije!N227)","v":{"v":811,"d":"08-11"}},{"$f":"IF(ISBLANK(partije!O227),\"\",partije!O227)","v":{"v":1108,"d":"11-08"}},{"$f":"IF(ISBLANK(partije!P227),\"\",partije!P227)","v":{"v":711,"d":"07-11"}},{"$f":"IF(ISBLANK(partije!Q227),\"\",partije!Q227)","v":""},{"$f":"IF(ISBLANK(partije!R227),\"\",partije!R227)","v":""}]
[30,null,{"$f":"IF(ISNA(MATCH(A60,spisak!$E$4:$E$199,0)),IF(ISNA(MATCH(A60,plasman!$I$3:$I$68,0)),\"bye\",INDEX(plasman!$H$3:$H$68,MATCH(A60,plasman!$I$3:$I$68,0))),INDEX(spisak!$B$4:$B$199,MATCH(A60,spisak!$E$4:$E$199,0)))","v":"Konstantinov Marko"},{"$nulls":3},{"$f":"IF(ISNA(MATCH(C60,spisak!$B$4:$B$199,0)),\"\",INDEX(spisak!$C$4:$C$199,MATCH(C60,spisak!$B$4:$B$199,0)))","v":"Vršac"}]
[null,null,{"$f":"IF(ISNA(MATCH(A61,spisak!$E$4:$E$199,0)),IF(ISNA(MATCH(A61,plasman!$I$3:$I$68,0)),\"bye\",INDEX(plasman!$H$3:$H$68,MATCH(A61,plasman!$I$3:$I$68,0))),INDEX(spisak!$B$4:$B$199,MATCH(A61,spisak!$E$4:$E$199,0)))","v":0},{"$nulls":3},{"$f":"IF(ISNA(MATCH(C61,spisak!$B$4:$B$199,0)),\"\",INDEX(spisak!$C$4:$C$199,MATCH(C61,spisak!$B$4:$B$199,0)))","v":""},null,null,{"$f":"IF(ISBLANK(partije!L214),\"\",partije!L214)","v":{"v":1210,"d":"12-10"}},{"$f":"IF(ISBLANK(partije!M214),\"\",partije!M214)","v":{"v":1113,"d":"11-13"}},{"$f":"IF(ISBLANK(partije!N214),\"\",partije!N214)","v":{"v":1104,"d":"11-04"}},{"$f":"IF(ISBLANK(partije!O214),\"\",partije!O214)","v":{"v":611,"d":"06-11"}},{"$f":"IF(ISBLANK(partije!P214),\"\",partije!P214)","v":{"v":1109,"d":"11-09"}},{"$f":"IF(ISBLANK(partije!Q214),\"\",partije!Q214)","v":""},{"$f":"IF(ISBLANK(partije!R214),\"\",partije!R214)","v":""},{"$f":"partije!$S$223","v":"Šepa Matija"},{"$nulls":4},{"$f":"IF(ISBLANK(partije!J223),\"\",IF(partije!J223>partije!K223,partije!J223,partije!K223))","v":3},{"$f":"IF(ISBLANK(partije!J223),\"\",IF(partije!J223>partije!K223,partije!K223,partije!J223))","v":0}]
[31,null,{"$f":"IF(ISNA(MATCH(A62,spisak!$E$4:$E$199,0)),IF(ISNA(MATCH(A62,plasman!$I$3:$I$68,0)),\"bye\",INDEX(plasman!$H$3:$H$68,MATCH(A62,plasman!$I$3:$I$68,0))),INDEX(spisak!$B$4:$B$199,MATCH(A62,spisak!$E$4:$E$199,0)))","v":"Miovčić Mihailo"},{"$nulls":3},{"$f":"IF(ISNA(MATCH(C62,spisak!$B$4:$B$199,0)),\"\",INDEX(spisak!$C$4:$C$199,MATCH(C62,spisak!$B$4:$B$199,0)))","v":"Sinđelić Beograd"}]
[null,null,{"$f":"IF(ISNA(MATCH(A63,spisak!$E$4:$E$199,0)),IF(ISNA(MATCH(A63,plasman!$I$3:$I$68,0)),\"bye\",INDEX(plasman!$H$3:$H$68,MATCH(A63,plasman!$I$3:$I$68,0))),INDEX(spisak!$B$4:$B$199,MATCH(A63,spisak!$E$4:$E$199,0)))","v":0},{"$nulls":3},{"$f":"IF(ISNA(MATCH(C63,spisak!$B$4:$B$199,0)),\"\",INDEX(spisak!$C$4:$C$199,MATCH(C63,spisak!$B$4:$B$199,0)))","v":""},null,null,{"$f":"partije!$S$215","v":"Šepa Matija"},{"$nulls":4},{"$f":"IF(ISBLANK(partije!J215),\"\",IF(partije!J215>partije!K215,partije!J215,partije!K215))","v":3},{"$f":"IF(ISBLANK(partije!J215),\"\",IF(partije!J215>partije!K215,partije!K215,partije!J215))","v":0},{"$f":"IF(ISBLANK(partije!L223),\"\",partije!L223)","v":{"v":711,"d":"07-11"}},{"$f":"IF(ISBLANK(partije!M223),\"\",partije!M223)","v":{"v":111,"d":"01-11"}},{"$f":"IF(ISBLANK(partije!N223),\"\",partije!N223)","v":{"v":511,"d":"05-11"}},{"$f":"IF(ISBLANK(partije!O223),\"\",partije!O223)","v":""},{"$f":"IF(ISBLANK(partije!P223),\"\",partije!P223)","v":""},{"$f":"IF(ISBLANK(partije!Q223),\"\",partije!Q223)","v":""},{"$f":"IF(ISBLANK(partije!R223),\"\",partije!R223)","v":""}]
[32,2,{"$f":"IF(ISNA(MATCH(A64,spisak!$E$4:$E$199,0)),IF(ISNA(MATCH(A64,plasman!$I$3:$I$68,0)),\"bye\",INDEX(plasman!$H$3:$H$68,MATCH(A64,plasman!$I$3:$I$68,0))),INDEX(spisak!$B$4:$B$199,MATCH(A64,spisak!$E$4:$E$199,0)))","v":"Šepa Matija"},{"$nulls":3},{"$f":"IF(ISNA(MATCH(C64,spisak!$B$4:$B$199,0)),\"\",INDEX(spisak!$C$4:$C$199,MATCH(C64,spisak!$B$4:$B$199,0)))","v":"Stak Zemun"}]
[null,null,{"$f":"IF(ISNA(MATCH(A65,spisak!$E$4:$E$199,0)),IF(ISNA(MATCH(A65,plasman!$I$3:$I$68,0)),\"bye\",INDEX(plasman!$H$3:$H$68,MATCH(A65,plasman!$I$3:$I$68,0))),INDEX(spisak!$B$4:$B$199,MATCH(A65,spisak!$E$4:$E$199,0)))","v":0},{"$nulls":3},{"$f":"IF(ISNA(MATCH(C65,spisak!$B$4:$B$199,0)),\"\",INDEX(spisak!$C$4:$C$199,MATCH(C65,spisak!$B$4:$B$199,0)))","v":""},null,null,{"$f":"IF(ISBLANK(partije!L215),\"\",partije!L215)","v":{"v":211,"d":"02-11"}},{"$f":"IF(ISBLANK(partije!M215),\"\",partije!M215)","v":{"v":411,"d":"04-11"}},{"$f":"IF(ISBLANK(partije!N215),\"\",partije!N215)","v":{"v":711,"d":"07-11"}},{"$f":"IF(ISBLANK(partije!O215),\"\",partije!O215)","v":""},{"$f":"IF(ISBLANK(partije!P215),\"\",partije!P215)","v":""},{"$f":"IF(ISBLANK(partije!Q215),\"\",partije!Q215)","v":""},{"$f":"IF(ISBLANK(partije!R215),\"\",partije!R215)","v":""}]
[]
[{"$f":"CONCATENATE(info!C6,\", \",info!C5)","v":"Niš, 02.2.2019."},{"$nulls":36},{"$f":"info!C7","v":"RSTSN"}]
[33,1,{"$f":"IF(ISNA(MATCH(A68,spisak!$E$4:$E$199,0)),IF(ISNA(MATCH(A68,plasman!$I$3:$I$68,0)),\"bye\",INDEX(plasman!$H$3:$H$68,MATCH(A68,plasman!$I$3:$I$68,0))),INDEX(spisak!$B$4:$B$199,MATCH(A68,spisak!$E$4:$E$199,0)))","v":"bye"},{"$nulls":3},{"$f":"IF(ISNA(MATCH(C68,spisak!$B$4:$B$199,0)),\"\",INDEX(spisak!$C$4:$C$199,MATCH(C68,spisak!$B$4:$B$199,0)))","v":""},null,null,{"$f":"partije!$S$231","v":"bye"},{"$nulls":4},{"$f":"IF(ISBLANK(partije!$J$231),\"\",IF(partije!$J$231>partije!$K$231,partije!$J$231,partije!$K$231))","v":""},{"$f":"IF(ISBLANK(partije!$J$231),\"\",IF(partije!$J$231>partije!$K$231,partije!$K$231,partije!$J$231))","v":""}]
[34,null,{"$f":"IF(ISNA(MATCH(A69,spisak!$E$4:$E$199,0)),IF(ISNA(MATCH(A69,plasman!$I$3:$I$68,0)),\"bye\",INDEX(plasman!$H$3:$H$68,MATCH(A69,plasman!$I$3:$I$68,0))),INDEX(spisak!$B$4:$B$199,MATCH(A69,spisak!$E$4:$E$199,0)))","v":"bye"},{"$nulls":3},{"$f":"IF(ISNA(MATCH(C69,spisak!$B$4:$B$199,0)),\"\",INDEX(spisak!$C$4:$C$199,MATCH(C69,spisak!$B$4:$B$199,0)))","v":""}]
[null,null,{"$f":"IF(ISNA(MATCH(A70,spisak!$E$4:$E$199,0)),IF(ISNA(MATCH(A70,plasman!$I$3:$I$68,0)),\"bye\",INDEX(plasman!$H$3:$H$68,MATCH(A70,plasman!$I$3:$I$68,0))),INDEX(spisak!$B$4:$B$199,MATCH(A70,spisak!$E$4:$E$199,0)))","v":0},{"$nulls":3},{"$f":"IF(ISNA(MATCH(C70,spisak!$B$4:$B$199,0)),\"\",INDEX(spisak!$C$4:$C$199,MATCH(C70,spisak!$B$4:$B$199,0)))","v":""},null,null,{"$f":"IF(ISBLANK(partije!$L$231),\"\",partije!$L$231)","v":""},{"$f":"IF(ISBLANK(partije!$M$231),\"\",partije!$M$231)","v":""},{"$f":"IF(ISBLANK(partije!$N$231),\"\",partije!$N$231)","v":""},{"$f":"IF(ISBLANK(partije!$O$231),\"\",partije!$O$231)","v":""},{"$f":"IF(ISBLANK(partije!$P$231),\"\",partije!$P$231)","v":""},{"$f":"IF(ISBLANK(partije!$Q$231),\"\",partije!$Q$231)","v":""},{"$f":"IF(ISBLANK(partije!$R$231),\"\",partije!$R$231)","v":""},{"$f":"partije!$S$247","v":"bye"},{"$nulls":4},{"$f":"IF(ISBLANK(partije!$J$247),\"\",IF(partije!$J$247>partije!$K$247,partije!$J$247,partije!$K$247))","v":""},{"$f":"IF(ISBLANK(partije!$J$247),\"\",IF(partije!$J$247>partije!$K$247,partije!$K$247,partije!$J$247))","v":""}]
[35,null,{"$f":"IF(ISNA(MATCH(A71,spisak!$E$4:$E$199,0)),IF(ISNA(MATCH(A71,plasman!$I$3:$I$68,0)),\"bye\",INDEX(plasman!$H$3:$H$68,MATCH(A71,plasman!$I$3:$I$68,0))),INDEX(spisak!$B$4:$B$199,MATCH(A71,spisak!$E$4:$E$199,0)))","v":"bye"},{"$nulls":3},{"$f":"IF(ISNA(MATCH(C71,spisak!$B$4:$B$199,0)),\"\",INDEX(spisak!$C$4:$C$199,MATCH(C71,spisak!$B$4:$B$199,0)))","v":""}]
[null,null,{"$f":"IF(ISNA(MATCH(A72,spisak!$E$4:$E$199,0)),IF(ISNA(MATCH(A72,plasman!$I$3:$I$68,0)),\"bye\",INDEX(plasman!$H$3:$H$68,MATCH(A72,plasman!$I$3:$I$68,0))),INDEX(spisak!$B$4:$B$199,MATCH(A72,spisak!$E$4:$E$199,0)))","v":0},{"$nulls":3},{"$f":"IF(ISNA(MATCH(C72,spisak!$B$4:$B$199,0)),\"\",INDEX(spisak!$C$4:$C$199,MATCH(C72,spisak!$B$4:$B$199,0)))","v":""},null,null,{"$f":"partije!$S$232","v":"bye"},{"$nulls":4},{"$f":"IF(ISBLANK(partije!$J$232),\"\",IF(partije!$J$232>partije!$K$232,partije!$J$232,partije!$K$232))","v":""},{"$f":"IF(ISBLANK(partije!$J$232),\"\",IF(partije!$J$232>partije!$K$232,partije!$K$232,partije!$J$232))","v":""},{"$f":"IF(ISBLANK(partije!$L$247),\"\",partije!$L$247)","v":""},{"$f":"IF(ISBLANK(partije!$M$247),\"\",partije!$M$247)","v":""},{"$f":"IF(ISBLANK(partije!$N$247),\"\",partije!$N$247)","v":""},{"$f":"IF(ISBLANK(partije!$O$247),\"\",partije!$O$247)","v":""},{"$f":"IF(ISBLANK(partije!$P$247),\"\",partije!$P$247)","v":""},{"$f":"IF(ISBLANK(partije!$Q$247),\"\",partije!$Q$247)","v":""},{"$f":"IF(ISBLANK(partije!$R$247),\"\",partije!$R$247)","v":""}]
[36,16,{"$f":"IF(ISNA(MATCH(A73,spisak!$E$4:$E$199,0)),IF(ISNA(MATCH(A73,plasman!$I$3:$I$68,0)),\"bye\",INDEX(plasman!$H$3:$H$68,MATCH(A73,plasman!$I$3:$I$68,0))),INDEX(spisak!$B$4:$B$199,MATCH(A73,spisak!$E$4:$E$199,0)))","v":"bye"},{"$nulls":3},{"$f":"IF(ISNA(MATCH(C73,spisak!$B$4:$B$199,0)),\"\",INDEX(spisak!$C$4:$C$199,MATCH(C73,spisak!$B$4:$B$199,0)))","v":""}]
[null,16,{"$f":"IF(ISNA(MATCH(A74,spisak!$E$4:$E$199,0)),IF(ISNA(MATCH(A74,plasman!$I$3:$I$68,0)),\"bye\",INDEX(plasman!$H$3:$H$68,MATCH(A74,plasman!$I$3:$I$68,0))),INDEX(spisak!$B$4:$B$199,MATCH(A74,spisak!$E$4:$E$199,0)))","v":0},{"$nulls":3},{"$f":"IF(ISNA(MATCH(C74,spisak!$B$4:$B$199,0)),\"\",INDEX(spisak!$C$4:$C$199,MATCH(C74,spisak!$B$4:$B$199,0)))","v":""},null,null,{"$f":"IF(ISBLANK(partije!$L$232),\"\",partije!$L$232)","v":""},{"$f":"IF(ISBLANK(partije!$M$232),\"\",partije!$M$232)","v":""},{"$f":"IF(ISBLANK(partije!$N$232),\"\",partije!$N$232)","v":""},{"$f":"IF(ISBLANK(partije!$O$232),\"\",partije!$O$232)","v":""},{"$f":"IF(ISBLANK(partije!$P$232),\"\",partije!$P$232)","v":""},{"$f":"IF(ISBLANK(partije!$Q$232),\"\",partije!$Q$232)","v":""},{"$f":"IF(ISBLANK(partije!$R$232),\"\",partije!$R$232)","v":""},{"$nulls":7},{"$f":"partije!$S$255","v":"bye"},{"$nulls":4},{"$f":"IF(ISBLANK(partije!$J$255),\"\",IF(partije!$J$255>partije!$K$255,partije!$J$255,partije!$K$255))","v":""},{"$f":"IF(ISBLANK(partije!$J$255),\"\",IF(partije!$J$255>partije!$K$255,partije!$K$255,partije!$J$255))","v":""}]
[37,9,{"$f":"IF(ISNA(MATCH(A75,spisak!$E$4:$E$199,0)),IF(ISNA(MATCH(A75,plasman!$I$3:$I$68,0)),\"bye\",INDEX(plasman!$H$3:$H$68,MATCH(A75,plasman!$I$3:$I$68,0))),INDEX(spisak!$B$4:$B$199,MATCH(A75,spisak!$E$4:$E$199,0)))","v":"bye"},{"$nulls":3},{"$f":"IF(ISNA(MATCH(C75,spisak!$B$4:$B$199,0)),\"\",INDEX(spisak!$C$4:$C$199,MATCH(C75,spisak!$B$4:$B$199,0)))","v":""}]
[null,9,{"$f":"IF(ISNA(MATCH(A76,spisak!$E$4:$E$199,0)),IF(ISNA(MATCH(A76,plasman!$I$3:$I$68,0)),\"bye\",INDEX(plasman!$H$3:$H$68,MATCH(A76,plasman!$I$3:$I$68,0))),INDEX(spisak!$B$4:$B$199,MATCH(A76,spisak!$E$4:$E$199,0)))","v":0},{"$nulls":3},{"$f":"IF(ISNA(MATCH(C76,spisak!$B$4:$B$199,0)),\"\",INDEX(spisak!$C$4:$C$199,MATCH(C76,spisak!$B$4:$B$199,0)))","v":""},null,null,{"$f":"partije!$S$233","v":"bye"},{"$nulls":4},{"$f":"IF(ISBLANK(partije!$J$233),\"\",IF(partije!$J$233>partije!$K$233,partije!$J$233,partije!$K$233))","v":""},{"$f":"IF(ISBLANK(partije!$J$233),\"\",IF(partije!$J$233>partije!$K$233,partije!$K$233,partije!$J$233))","v":""},{"$nulls":7},{"$f":"IF(ISBLANK(partije!$L$255),\"\",partije!$L$255)","v":""},{"$f":"IF(ISBLANK(partije!$M$255),\"\",partije!$M$255)","v":""},{"$f":"IF(ISBLANK(partije!$N$255),\"\",partije!$N$255)","v":""},{"$f":"IF(ISBLANK(partije!$O$255),\"\",partije!$O$255)","v":""},{"$f":"IF(ISBLANK(partije!$P$255),\"\",partije!$P$255)","v":""},{"$f":"IF(ISBLANK(partije!$Q$255),\"\",partije!$Q$255)","v":""},{"$f":"IF(ISBLANK(partije!$R$255),\"\",partije!$R$255)","v":""}]
[38,null,{"$f":"IF(ISNA(MATCH(A77,spisak!$E$4:$E$199,0)),IF(ISNA(MATCH(A77,plasman!$I$3:$I$68,0)),\"bye\",INDEX(plasman!$H$3:$H$68,MATCH(A77,plasman!$I$3:$I$68,0))),INDEX(spisak!$B$4:$B$199,MATCH(A77,spisak!$E$4:$E$199,0)))","v":"bye"},{"$nulls":3},{"$f":"IF(ISNA(MATCH(C77,spisak!$B$4:$B$199,0)),\"\",INDEX(spisak!$C$4:$C$199,MATCH(C77,spisak!$B$4:$B$199,0)))","v":""}]
[null,null,{"$f":"IF(ISNA(MATCH(A78,spisak!$E$4:$E$199,0)),IF(ISNA(MATCH(A78,plasman!$I$3:$I$68,0)),\"bye\",INDEX(plasman!$H$3:$H$68,MATCH(A78,plasman!$I$3:$I$68,0))),INDEX(spisak!$B$4:$B$199,MATCH(A78,spisak!$E$4:$E$199,0)))","v":0},{"$nulls":3},{"$f":"IF(ISNA(MATCH(C78,spisak!$B$4:$B$199,0)),\"\",INDEX(spisak!$C$4:$C$199,MATCH(C78,spisak!$B$4:$B$199,0)))","v":""},null,null,{"$f":"IF(ISBLANK(partije!$L$233),\"\",partije!$L$233)","v":""},{"$f":"IF(ISBLANK(partije!$M$233),\"\",partije!$M$233)","v":""},{"$f":"IF(ISBLANK(partije!$N$233),\"\",partije!$N$233)","v":""},{"$f":"IF(ISBLANK(partije!$O$233),\"\",partije!$O$233)","v":""},{"$f":"IF(ISBLANK(partije!$P$233),\"\",partije!$P$233)","v":""},{"$f":"IF(ISBLANK(partije!$Q$233),\"\",partije!$Q$233)","v":""},{"$f":"IF(ISBLANK(partije!$R$233),\"\",partije!$R$233)","v":""},{"$f":"partije!$S$248","v":"bye"},{"$nulls":4},{"$f":"IF(ISBLANK(partije!$J$248),\"\",IF(partije!$J$248>partije!$K$248,partije!$J$248,partije!$K$248))","v":""},{"$f":"IF(ISBLANK(partije!$J$248),\"\",IF(partije!$J$248>partije!$K$248,partije!$K$248,partije!$J$248))","v":""}]
[39,null,{"$f":"IF(ISNA(MATCH(A79,spisak!$E$4:$E$199,0)),IF(ISNA(MATCH(A79,plasman!$I$3:$I$68,0)),\"bye\",INDEX(plasman!$H$3:$H$68,MATCH(A79,plasman!$I$3:$I$68,0))),INDEX(spisak!$B$4:$B$199,MATCH(A79,spisak!$E$4:$E$199,0)))","v":"bye"},{"$nulls":3},{"$f":"IF(ISNA(MATCH(C79,spisak!$B$4:$B$199,0)),\"\",INDEX(spisak!$C$4:$C$199,MATCH(C79,spisak!$B$4:$B$199,0)))","v":""}]
[null,null,{"$f":"IF(ISNA(MATCH(A80,spisak!$E$4:$E$199,0)),IF(ISNA(MATCH(A80,plasman!$I$3:$I$68,0)),\"bye\",INDEX(plasman!$H$3:$H$68,MATCH(A80,plasman!$I$3:$I$68,0))),INDEX(spisak!$B$4:$B$199,MATCH(A80,spisak!$E$4:$E$199,0)))","v":0},{"$nulls":3},{"$f":"IF(ISNA(MATCH(C80,spisak!$B$4:$B$199,0)),\"\",INDEX(spisak!$C$4:$C$199,MATCH(C80,spisak!$B$4:$B$199,0)))","v":""},null,null,{"$f":"partije!$S$234","v":"bye"},{"$nulls":4},{"$f":"IF(ISBLANK(partije!$J$234),\"\",IF(partije!$J$234>partije!$K$234,partije!$J$234,partije!$K$234))","v":""},{"$f":"IF(ISBLANK(partije!$J$234),\"\",IF(partije!$J$234>partije!$K$234,partije!$K$234,partije!$J$234))","v":""},{"$f":"IF(ISBLANK(partije!$L$248),\"\",partije!$L$248)","v":""},{"$f":"IF(ISBLANK(partije!$M$248),\"\",partije!$M$248)","v":""},{"$f":"IF(ISBLANK(partije!$N$248),\"\",partije!$N$248)","v":""},{"$f":"IF(ISBLANK(partije!$O$248),\"\",partije!$O$248)","v":""},{"$f":"IF(ISBLANK(partije!$P$248),\"\",partije!$P$248)","v":""},{"$f":"IF(ISBLANK(partije!$Q$248),\"\",partije!$Q$248)","v":""},{"$f":"IF(ISBLANK(partije!$R$248),\"\",partije!$R$248)","v":""}]
[40,8,{"$f":"IF(ISNA(MATCH(A81,spisak!$E$4:$E$199,0)),IF(ISNA(MATCH(A81,plasman!$I$3:$I$68,0)),\"bye\",INDEX(plasman!$H$3:$H$68,MATCH(A81,plasman!$I$3:$I$68,0))),INDEX(spisak!$B$4:$B$199,MATCH(A81,spisak!$E$4:$E$199,0)))","v":"bye"},{"$nulls":3},{"$f":"IF(ISNA(MATCH(C81,spisak!$B$4:$B$199,0)),\"\",INDEX(spisak!$C$4:$C$199,MATCH(C81,spisak!$B$4:$B$199,0)))","v":""}]
[null,8,{"$f":"IF(ISNA(MATCH(A82,spisak!$E$4:$E$199,0)),IF(ISNA(MATCH(A82,plasman!$I$3:$I$68,0)),\"bye\",INDEX(plasman!$H$3:$H$68,MATCH(A82,plasman!$I$3:$I$68,0))),INDEX(spisak!$B$4:$B$199,MATCH(A82,spisak!$E$4:$E$199,0)))","v":0},{"$nulls":3},{"$f":"IF(ISNA(MATCH(C82,spisak!$B$4:$B$199,0)),\"\",INDEX(spisak!$C$4:$C$199,MATCH(C82,spisak!$B$4:$B$199,0)))","v":""},null,null,{"$f":"IF(ISBLANK(partije!$L$234),\"\",partije!$L$234)","v":""},{"$f":"IF(ISBLANK(partije!$M$234),\"\",partije!$M$234)","v":""},{"$f":"IF(ISBLANK(partije!$N$234),\"\",partije!$N$234)","v":""},{"$f":"IF(ISBLANK(partije!$O$234),\"\",partije!$O$234)","v":""},{"$f":"IF(ISBLANK(partije!$P$234),\"\",partije!$P$234)","v":""},{"$f":"IF(ISBLANK(partije!$Q$234),\"\",partije!$Q$234)","v":""},{"$f":"IF(ISBLANK(partije!$R$234),\"\",partije!$R$234)","v":""}]
[41,5,{"$f":"IF(ISNA(MATCH(A83,spisak!$E$4:$E$199,0)),IF(ISNA(MATCH(A83,plasman!$I$3:$I$68,0)),\"bye\",INDEX(plasman!$H$3:$H$68,MATCH(A83,plasman!$I$3:$I$68,0))),INDEX(spisak!$B$4:$B$199,MATCH(A83,spisak!$E$4:$E$199,0)))","v":"bye"},{"$nulls":3},{"$f":"IF(ISNA(MATCH(C83,spisak!$B$4:$B$199,0)),\"\",INDEX(spisak!$C$4:$C$199,MATCH(C83,spisak!$B$4:$B$199,0)))","v":""},{"$nulls":23},{"$f":"partije!$S$259","v":"bye"},{"$nulls":4},{"$f":"IF(ISBLANK(partije!$J$259),\"\",IF(partije!$J$259>partije!$K$259,partije!$J$259,partije!$K$259))","v":""},{"$f":"IF(ISBLANK(partije!$J$259),\"\",IF(partije!$J$259>partije!$K$259,partije!$K$259,partije!$J$259))","v":""}]
[null,5,{"$f":"IF(ISNA(MATCH(A84,spisak!$E$4:$E$199,0)),IF(ISNA(MATCH(A84,plasman!$I$3:$I$68,0)),\"bye\",INDEX(plasman!$H$3:$H$68,MATCH(A84,plasman!$I$3:$I$68,0))),INDEX(spisak!$B$4:$B$199,MATCH(A84,spisak!$E$4:$E$199,0)))","v":0},{"$nulls":3},{"$f":"IF(ISNA(MATCH(C84,spisak!$B$4:$B$199,0)),\"\",INDEX(spisak!$C$4:$C$199,MATCH(C84,spisak!$B$4:$B$199,0)))","v":""},null,null,{"$f":"partije!$S$235","v":"bye"},{"$nulls":4},{"$f":"IF(ISBLANK(partije!$J$235),\"\",IF(partije!$J$235>partije!$K$235,partije!$J$235,partije!$K$235))","v":""},{"$f":"IF(ISBLANK(partije!$J$235),\"\",IF(partije!$J$235>partije!$K$235,partije!$K$235,partije!$J$235))","v":""}]
[42,null,{"$f":"IF(ISNA(MATCH(A85,spisak!$E$4:$E$199,0)),IF(ISNA(MATCH(A85,plasman!$I$3:$I$68,0)),\"bye\",INDEX(plasman!$H$3:$H$68,MATCH(A85,plasman!$I$3:$I$68,0))),INDEX(spisak!$B$4:$B$199,MATCH(A85,spisak!$E$4:$E$199,0)))","v":"bye"},{"$nulls":3},{"$f":"IF(ISNA(MATCH(C85,spisak!$B$4:$B$199,0)),\"\",INDEX(spisak!$C$4:$C$199,MATCH(C85,spisak!$B$4:$B$199,0)))","v":""},{"$nulls":23},{"$f":"IF(ISBLANK(partije!$L$259),\"\",partije!$L$259)","v":""},{"$f":"IF(ISBLANK(partije!$M$259),\"\",partije!$M$259)","v":""},{"$f":"IF(ISBLANK(partije!$N$259),\"\",partije!$N$259)","v":""},{"$f":"IF(ISBLANK(partije!$O$259),\"\",partije!$O$259)","v":""},{"$f":"IF(ISBLANK(partije!$P$259),\"\",partije!$P$259)","v":""},{"$f":"IF(ISBLANK(partije!$Q$259),\"\",partije!$Q$259)","v":""},{"$f":"IF(ISBLANK(partije!$R$259),\"\",partije!$R$259)","v":""}]
[null,null,{"$f":"IF(ISNA(MATCH(A86,spisak!$E$4:$E$199,0)),IF(ISNA(MATCH(A86,plasman!$I$3:$I$68,0)),\"bye\",INDEX(plasman!$H$3:$H$68,MATCH(A86,plasman!$I$3:$I$68,0))),INDEX(spisak!$B$4:$B$199,MATCH(A86,spisak!$E$4:$E$199,0)))","v":0},{"$nulls":3},{"$f":"IF(ISNA(MATCH(C86,spisak!$B$4:$B$199,0)),\"\",INDEX(spisak!$C$4:$C$199,MATCH(C86,spisak!$B$4:$B$199,0)))","v":""},null,null,{"$f":"IF(ISBLANK(partije!$L$235),\"\",partije!$L$235)","v":""},{"$f":"IF(ISBLANK(partije!$M$235),\"\",partije!$M$235)","v":""},{"$f":"IF(ISBLANK(partije!$M$235),\"\",partije!$M$235)","v":""},{"$f":"IF(ISBLANK(partije!$M$235),\"\",partije!$M$235)","v":""},{"$f":"IF(ISBLANK(partije!$M$235),\"\",partije!$M$235)","v":""},{"$f":"IF(ISBLANK(partije!$M$235),\"\",partije!$M$235)","v":""},{"$f":"IF(ISBLANK(partije!$M$235),\"\",partije!$M$235)","v":""},{"$f":"partije!$S$249","v":"bye"},{"$nulls":4},{"$f":"IF(ISBLANK(partije!$J$249),\"\",IF(partije!$J$249>partije!$K$249,partije!$J$249,partije!$K$249))","v":""},{"$f":"IF(ISBLANK(partije!$J$249),\"\",IF(partije!$J$249>partije!$K$249,partije!$K$249,partije!$J$249))","v":""}]
[43,null,{"$f":"IF(ISNA(MATCH(A87,spisak!$E$4:$E$199,0)),IF(ISNA(MATCH(A87,plasman!$I$3:$I$68,0)),\"bye\",INDEX(plasman!$H$3:$H$68,MATCH(A87,plasman!$I$3:$I$68,0))),INDEX(spisak!$B$4:$B$199,MATCH(A87,spisak!$E$4:$E$199,0)))","v":"bye"},{"$nulls":3},{"$f":"IF(ISNA(MATCH(C87,spisak!$B$4:$B$199,0)),\"\",INDEX(spisak!$C$4:$C$199,MATCH(C87,spisak!$B$4:$B$199,0)))","v":""}]
[null,null,{"$f":"IF(ISNA(MATCH(A88,spisak!$E$4:$E$199,0)),IF(ISNA(MATCH(A88,plasman!$I$3:$I$68,0)),\"bye\",INDEX(plasman!$H$3:$H$68,MATCH(A88,plasman!$I$3:$I$68,0))),INDEX(spisak!$B$4:$B$199,MATCH(A88,spisak!$E$4:$E$199,0)))","v":0},{"$nulls":3},{"$f":"IF(ISNA(MATCH(C88,spisak!$B$4:$B$199,0)),\"\",INDEX(spisak!$C$4:$C$199,MATCH(C88,spisak!$B$4:$B$199,0)))","v":""},null,null,{"$f":"partije!$S$236","v":"bye"},{"$nulls":4},{"$f":"IF(ISBLANK(partije!$J$236),\"\",IF(partije!$J$236>partije!$K$236,partije!$J$236,partije!$K$236))","v":""},{"$f":"IF(ISBLANK(partije!$J$236),\"\",IF(partije!$J$236>partije!$K$236,partije!$K$236,partije!$J$236))","v":""},{"$f":"IF(ISBLANK(partije!$L$249),\"\",partije!$L$249)","v":""},{"$f":"IF(ISBLANK(partije!$M$249),\"\",partije!$M$249)","v":""},{"$f":"IF(ISBLANK(partije!$N$249),\"\",partije!$N$249)","v":""},{"$f":"IF(ISBLANK(partije!$O$249),\"\",partije!$O$249)","v":""},{"$f":"IF(ISBLANK(partije!$P$249),\"\",partije!$P$249)","v":""},{"$f":"IF(ISBLANK(partije!$Q$249),\"\",partije!$Q$249)","v":""},{"$f":"IF(ISBLANK(partije!$R$249),\"\",partije!$R$249)","v":""}]
[44,12,{"$f":"IF(ISNA(MATCH(A89,spisak!$E$4:$E$199,0)),IF(ISNA(MATCH(A89,plasman!$I$3:$I$68,0)),\"bye\",INDEX(plasman!$H$3:$H$68,MATCH(A89,plasman!$I$3:$I$68,0))),INDEX(spisak!$B$4:$B$199,MATCH(A89,spisak!$E$4:$E$199,0)))","v":"bye"},{"$nulls":3},{"$f":"IF(ISNA(MATCH(C89,spisak!$B$4:$B$199,0)),\"\",INDEX(spisak!$C$4:$C$199,MATCH(C89,spisak!$B$4:$B$199,0)))","v":""}]
[null,12,{"$f":"IF(ISNA(MATCH(A90,spisak!$E$4:$E$199,0)),IF(ISNA(MATCH(A90,plasman!$I$3:$I$68,0)),\"bye\",INDEX(plasman!$H$3:$H$68,MATCH(A90,plasman!$I$3:$I$68,0))),INDEX(spisak!$B$4:$B$199,MATCH(A90,spisak!$E$4:$E$199,0)))","v":0},{"$nulls":3},{"$f":"IF(ISNA(MATCH(C90,spisak!$B$4:$B$199,0)),\"\",INDEX(spisak!$C$4:$C$199,MATCH(C90,spisak!$B$4:$B$199,0)))","v":""},null,null,{"$f":"IF(ISBLANK(partije!$L$236),\"\",partije!$L$236)","v":""},{"$f":"IF(ISBLANK(partije!$M$236),\"\",partije!$M$236)","v":""},{"$f":"IF(ISBLANK(partije!$N$236),\"\",partije!$N$236)","v":""},{"$f":"IF(ISBLANK(partije!$O$236),\"\",partije!$O$236)","v":""},{"$f":"IF(ISBLANK(partije!$P$236),\"\",partije!$P$236)","v":""},{"$f":"IF(ISBLANK(partije!$Q$236),\"\",partije!$Q$236)","v":""},{"$f":"IF(ISBLANK(partije!$R$236),\"\",partije!$R$236)","v":""},{"$nulls":7},{"$f":"partije!$S$256","v":"bye"},{"$nulls":4},{"$f":"IF(ISBLANK(partije!$J$256),\"\",IF(partije!$J$256>partije!$K$256,partije!$J$256,partije!$K$256))","v":""},{"$f":"IF(ISBLANK(partije!$J$256),\"\",IF(partije!$J$256>partije!$K$256,partije!$K$256,partije!$J$256))","v":""}]
[45,13,{"$f":"IF(ISNA(MATCH(A91,spisak!$E$4:$E$199,0)),IF(ISNA(MATCH(A91,plasman!$I$3:$I$68,0)),\"bye\",INDEX(plasman!$H$3:$H$68,MATCH(A91,plasman!$I$3:$I$68,0))),INDEX(spisak!$B$4:$B$199,MATCH(A91,spisak!$E$4:$E$199,0)))","v":"bye"},{"$nulls":3},{"$f":"IF(ISNA(MATCH(C91,spisak!$B$4:$B$199,0)),\"\",INDEX(spisak!$C$4:$C$199,MATCH(C91,spisak!$B$4:$B$199,0)))","v":""}]
[null,13,{"$f":"IF(ISNA(MATCH(A92,spisak!$E$4:$E$199,0)),IF(ISNA(MATCH(A92,plasman!$I$3:$I$68,0)),\"bye\",INDEX(plasman!$H$3:$H$68,MATCH(A92,plasman!$I$3:$I$68,0))),INDEX(spisak!$B$4:$B$199,MATCH(A92,spisak!$E$4:$E$199,0)))","v":0},{"$nulls":3},{"$f":"IF(ISNA(MATCH(C92,spisak!$B$4:$B$199,0)),\"\",INDEX(spisak!$C$4:$C$199,MATCH(C92,spisak!$B$4:$B$199,0)))","v":""},null,null,{"$f":"partije!$S$237","v":"bye"},{"$nulls":4},{"$f":"IF(ISBLANK(partije!$J$237),\"\",IF(partije!$J$237>partije!$K$237,partije!$J$237,partije!$K$237))","v":""},{"$f":"IF(ISBLANK(partije!$J$237),\"\",IF(partije!$J$237>partije!$K$237,partije!$K$237,partije!$J$237))","v":""},{"$nulls":7},{"$f":"IF(ISBLANK(partije!$L$256),\"\",partije!$L$256)","v":""},{"$f":"IF(ISBLANK(partije!$M$256),\"\",partije!$M$256)","v":""},{"$f":"IF(ISBLANK(partije!$N$256),\"\",partije!$N$256)","v":""},{"$f":"IF(ISBLANK(partije!$O$256),\"\",partije!$O$256)","v":""},{"$f":"IF(ISBLANK(partije!$P$256),\"\",partije!$P$256)","v":""},{"$f":"IF(ISBLANK(partije!$Q$256),\"\",partije!$Q$256)","v":""},{"$f":"IF(ISBLANK(partije!$R$256),\"\",partije!$R$256)","v":""}]
[46,null,{"$f":"IF(ISNA(MATCH(A93,spisak!$E$4:$E$199,0)),IF(ISNA(MATCH(A93,plasman!$I$3:$I$68,0)),\"bye\",INDEX(plasman!$H$3:$H$68,MATCH(A93,plasman!$I$3:$I$68,0))),INDEX(spisak!$B$4:$B$199,MATCH(A93,spisak!$E$4:$E$199,0)))","v":"bye"},{"$nulls":3},{"$f":"IF(ISNA(MATCH(C93,spisak!$B$4:$B$199,0)),\"\",INDEX(spisak!$C$4:$C$199,MATCH(C93,spisak!$B$4:$B$199,0)))","v":""}]
[null,null,{"$f":"IF(ISNA(MATCH(A94,spisak!$E$4:$E$199,0)),IF(ISNA(MATCH(A94,plasman!$I$3:$I$68,0)),\"bye\",INDEX(plasman!$H$3:$H$68,MATCH(A94,plasman!$I$3:$I$68,0))),INDEX(spisak!$B$4:$B$199,MATCH(A94,spisak!$E$4:$E$199,0)))","v":0},{"$nulls":3},{"$f":"IF(ISNA(MATCH(C94,spisak!$B$4:$B$199,0)),\"\",INDEX(spisak!$C$4:$C$199,MATCH(C94,spisak!$B$4:$B$199,0)))","v":""},null,null,{"$f":"IF(ISBLANK(partije!$L$237),\"\",partije!$L$237)","v":""},{"$f":"IF(ISBLANK(partije!$M$237),\"\",partije!$M$237)","v":""},{"$f":"IF(ISBLANK(partije!$N$237),\"\",partije!$N$237)","v":""},{"$f":"IF(ISBLANK(partije!$O$237),\"\",partije!$O$237)","v":""},{"$f":"IF(ISBLANK(partije!$P$237),\"\",partije!$P$237)","v":""},{"$f":"IF(ISBLANK(partije!$Q$237),\"\",partije!$Q$237)","v":""},{"$f":"IF(ISBLANK(partije!$R$237),\"\",partije!$R$237)","v":""},{"$f":"partije!$S$250","v":"bye"},{"$nulls":4},{"$f":"IF(ISBLANK(partije!$J$250),\"\",IF(partije!$J$250>partije!$K$250,partije!$J$250,partije!$K$250))","v":""},{"$f":"IF(ISBLANK(partije!$J$250),\"\",IF(partije!$J$250>partije!$K$250,partije!$K$250,partije!$J$250))","v":""}]
[47,null,{"$f":"IF(ISNA(MATCH(A95,spisak!$E$4:$E$199,0)),IF(ISNA(MATCH(A95,plasman!$I$3:$I$68,0)),\"bye\",INDEX(plasman!$H$3:$H$68,MATCH(A95,plasman!$I$3:$I$68,0))),INDEX(spisak!$B$4:$B$199,MATCH(A95,spisak!$E$4:$E$199,0)))","v":"bye"},{"$nulls":3},{"$f":"IF(ISNA(MATCH(C95,spisak!$B$4:$B$199,0)),\"\",INDEX(spisak!$C$4:$C$199,MATCH(C95,spisak!$B$4:$B$199,0)))","v":""}]
[null,null,{"$f":"IF(ISNA(MATCH(A96,spisak!$E$4:$E$199,0)),IF(ISNA(MATCH(A96,plasman!$I$3:$I$68,0)),\"bye\",INDEX(plasman!$H$3:$H$68,MATCH(A96,plasman!$I$3:$I$68,0))),INDEX(spisak!$B$4:$B$199,MATCH(A96,spisak!$E$4:$E$199,0)))","v":0},{"$nulls":3},{"$f":"IF(ISNA(MATCH(C96,spisak!$B$4:$B$199,0)),\"\",INDEX(spisak!$C$4:$C$199,MATCH(C96,spisak!$B$4:$B$199,0)))","v":""},null,null,{"$f":"partije!$S$238","v":"bye"},{"$nulls":4},{"$f":"IF(ISBLANK(partije!$J$238),\"\",IF(partije!$J$238>partije!$K$238,partije!$J$238,partije!$K$238))","v":""},{"$f":"IF(ISBLANK(partije!$J$238),\"\",IF(partije!$J$238>partije!$K$238,partije!$K$238,partije!$J$238))","v":""},{"$f":"IF(ISBLANK(partije!$L$250),\"\",partije!$L$250)","v":""},{"$f":"IF(ISBLANK(partije!$M$250),\"\",partije!$M$250)","v":""},{"$f":"IF(ISBLANK(partije!$N$250),\"\",partije!$N$250)","v":""},{"$f":"IF(ISBLANK(partije!$O$250),\"\",partije!$O$250)","v":""},{"$f":"IF(ISBLANK(partije!$P$250),\"\",partije!$P$250)","v":""},{"$f":"IF(ISBLANK(partije!$Q$250),\"\",partije!$Q$250)","v":""},{"$f":"IF(ISBLANK(partije!$R$250),\"\",partije!$R$250)","v":""}]
[48,4,{"$f":"IF(ISNA(MATCH(A97,spisak!$E$4:$E$199,0)),IF(ISNA(MATCH(A97,plasman!$I$3:$I$68,0)),\"bye\",INDEX(plasman!$H$3:$H$68,MATCH(A97,plasman!$I$3:$I$68,0))),INDEX(spisak!$B$4:$B$199,MATCH(A97,spisak!$E$4:$E$199,0)))","v":"bye"},{"$nulls":3},{"$f":"IF(ISNA(MATCH(C97,spisak!$B$4:$B$199,0)),\"\",INDEX(spisak!$C$4:$C$199,MATCH(C97,spisak!$B$4:$B$199,0)))","v":""}]
[null,4,{"$f":"IF(ISNA(MATCH(A98,spisak!$E$4:$E$199,0)),IF(ISNA(MATCH(A98,plasman!$I$3:$I$68,0)),\"bye\",INDEX(plasman!$H$3:$H$68,MATCH(A98,plasman!$I$3:$I$68,0))),INDEX(spisak!$B$4:$B$199,MATCH(A98,spisak!$E$4:$E$199,0)))","v":0},{"$nulls":3},{"$f":"IF(ISNA(MATCH(C98,spisak!$B$4:$B$199,0)),\"\",INDEX(spisak!$C$4:$C$199,MATCH(C98,spisak!$B$4:$B$199,0)))","v":""},null,null,{"$f":"IF(ISBLANK(partije!$L$238),\"\",partije!$L$238)","v":""},{"$f":"IF(ISBLANK(partije!$M$238),\"\",partije!$M$238)","v":""},{"$f":"IF(ISBLANK(partije!$N$238),\"\",partije!$N$238)","v":""},{"$f":"IF(ISBLANK(partije!$O$238),\"\",partije!$O$238)","v":""},{"$f":"IF(ISBLANK(partije!$P$238),\"\",partije!$P$238)","v":""},{"$f":"IF(ISBLANK(partije!$Q$238),\"\",partije!$Q$238)","v":""},{"$f":"IF(ISBLANK(partije!$R$238),\"\",partije!$R$238)","v":""}]
[49,3,{"$f":"IF(ISNA(MATCH(A99,spisak!$E$4:$E$199,0)),IF(ISNA(MATCH(A99,plasman!$I$3:$I$68,0)),\"bye\",INDEX(plasman!$H$3:$H$68,MATCH(A99,plasman!$I$3:$I$68,0))),INDEX(spisak!$B$4:$B$199,MATCH(A99,spisak!$E$4:$E$199,0)))","v":"bye"},{"$nulls":3},{"$f":"IF(ISNA(MATCH(C99,spisak!$B$4:$B$199,0)),\"\",INDEX(spisak!$C$4:$C$199,MATCH(C99,spisak!$B$4:$B$199,0)))","v":""},{"$nulls":23},{"$f":"partije!$S$261","v":"bye"},{"$nulls":4},{"$f":"IF(ISBLANK(partije!$J$261),\"\",IF(partije!$J$261>partije!$K$261,partije!$J$261,partije!$K$261))","v":""},{"$f":"IF(ISBLANK(partije!$J$261),\"\",IF(partije!$J$261>partije!$K$261,partije!$K$261,partije!$J$261))","v":""}]
[null,3,{"$f":"IF(ISNA(MATCH(A100,spisak!$E$4:$E$199,0)),IF(ISNA(MATCH(A100,plasman!$I$3:$I$68,0)),\"bye\",INDEX(plasman!$H$3:$H$68,MATCH(A100,plasman!$I$3:$I$68,0))),INDEX(spisak!$B$4:$B$199,MATCH(A100,spisak!$E$4:$E$199,0)))","v":0},{"$nulls":3},{"$f":"IF(ISNA(MATCH(C100,spisak!$B$4:$B$199,0)),\"\",INDEX(spisak!$C$4:$C$199,MATCH(C100,spisak!$B$4:$B$199,0)))","v":""},null,null,{"$f":"partije!$S$239","v":"bye"},{"$nulls":4},{"$f":"IF(ISBLANK(partije!$J$239),\"\",IF(partije!$J$239>partije!$K$239,partije!$J$239,partije!$K$239))","v":""},{"$f":"IF(ISBLANK(partije!$J$239),\"\",IF(partije!$J$239>partije!$K$239,partije!$K$239,partije!$J$239))","v":""}]
[50,null,{"$f":"IF(ISNA(MATCH(A101,spisak!$E$4:$E$199,0)),IF(ISNA(MATCH(A101,plasman!$I$3:$I$68,0)),\"bye\",INDEX(plasman!$H$3:$H$68,MATCH(A101,plasman!$I$3:$I$68,0))),INDEX(spisak!$B$4:$B$199,MATCH(A101,spisak!$E$4:$E$199,0)))","v":"bye"},{"$nulls":3},{"$f":"IF(ISNA(MATCH(C101,spisak!$B$4:$B$199,0)),\"\",INDEX(spisak!$C$4:$C$199,MATCH(C101,spisak!$B$4:$B$199,0)))","v":""},{"$nulls":23},{"$f":"IF(ISBLANK(partije!$L$261),\"\",partije!$L$261)","v":""},{"$f":"IF(ISBLANK(partije!$M$261),\"\",partije!$M$261)","v":""},{"$f":"IF(ISBLANK(partije!$N$261),\"\",partije!$N$261)","v":""},{"$f":"IF(ISBLANK(partije!$O$261),\"\",partije!$O$261)","v":""},{"$f":"IF(ISBLANK(partije!$P$261),\"\",partije!$P$261)","v":""},{"$f":"IF(ISBLANK(partije!$Q$261),\"\",partije!$Q$261)","v":""},{"$f":"IF(ISBLANK(partije!$R$261),\"\",partije!$R$261)","v":""}]
[null,null,{"$f":"IF(ISNA(MATCH(A102,spisak!$E$4:$E$199,0)),IF(ISNA(MATCH(A102,plasman!$I$3:$I$68,0)),\"bye\",INDEX(plasman!$H$3:$H$68,MATCH(A102,plasman!$I$3:$I$68,0))),INDEX(spisak!$B$4:$B$199,MATCH(A102,spisak!$E$4:$E$199,0)))","v":0},{"$nulls":3},{"$f":"IF(ISNA(MATCH(C102,spisak!$B$4:$B$199,0)),\"\",INDEX(spisak!$C$4:$C$199,MATCH(C102,spisak!$B$4:$B$199,0)))","v":""},null,null,{"$f":"IF(ISBLANK(partije!$L$239),\"\",partije!$L$239)","v":""},{"$f":"IF(ISBLANK(partije!$M$239),\"\",partije!$M$239)","v":""},{"$f":"IF(ISBLANK(partije!$N$239),\"\",partije!$N$239)","v":""},{"$f":"IF(ISBLANK(partije!$O$239),\"\",partije!$O$239)","v":""},{"$f":"IF(ISBLANK(partije!$P$239),\"\",partije!$P$239)","v":""},{"$f":"IF(ISBLANK(partije!$Q$239),\"\",partije!$Q$239)","v":""},{"$f":"IF(ISBLANK(partije!$R$239),\"\",partije!$R$239)","v":""},{"$f":"partije!$S$251","v":"bye"},{"$nulls":4},{"$f":"IF(ISBLANK(partije!$J$251),\"\",IF(partije!$J$251>partije!$K$251,partije!$J$251,partije!$K$251))","v":""},{"$f":"IF(ISBLANK(partije!$J$251),\"\",IF(partije!$J$251>partije!$K$251,partije!$K$251,partije!$J$251))","v":""}]
[51,null,{"$f":"IF(ISNA(MATCH(A103,spisak!$E$4:$E$199,0)),IF(ISNA(MATCH(A103,plasman!$I$3:$I$68,0)),\"bye\",INDEX(plasman!$H$3:$H$68,MATCH(A103,plasman!$I$3:$I$68,0))),INDEX(spisak!$B$4:$B$199,MATCH(A103,spisak!$E$4:$E$199,0)))","v":"bye"},{"$nulls":3},{"$f":"IF(ISNA(MATCH(C103,spisak!$B$4:$B$199,0)),\"\",INDEX(spisak!$C$4:$C$199,MATCH(C103,spisak!$B$4:$B$199,0)))","v":""}]
[null,null,{"$f":"IF(ISNA(MATCH(A104,spisak!$E$4:$E$199,0)),IF(ISNA(MATCH(A104,plasman!$I$3:$I$68,0)),\"bye\",INDEX(plasman!$H$3:$H$68,MATCH(A104,plasman!$I$3:$I$68,0))),INDEX(spisak!$B$4:$B$199,MATCH(A104,spisak!$E$4:$E$199,0)))","v":0},{"$nulls":3},{"$f":"IF(ISNA(MATCH(C104,spisak!$B$4:$B$199,0)),\"\",INDEX(spisak!$C$4:$C$199,MATCH(C104,spisak!$B$4:$B$199,0)))","v":""},null,null,{"$f":"partije!$S$240","v":"bye"},{"$nulls":4},{"$f":"IF(ISBLANK(partije!$J$240),\"\",IF(partije!$J$240>partije!$K$240,partije!$J$240,partije!$K$240))","v":""},{"$f":"IF(ISBLANK(partije!$J$240),\"\",IF(partije!$J$240>partije!$K$240,partije!$K$240,partije!$J$240))","v":""},{"$f":"IF(ISBLANK(partije!$L$251),\"\",partije!$L$251)","v":""},{"$f":"IF(ISBLANK(partije!$M$251),\"\",partije!$M$251)","v":""},{"$f":"IF(ISBLANK(partije!$N$251),\"\",partije!$N$251)","v":""},{"$f":"IF(ISBLANK(partije!$O$251),\"\",partije!$O$251)","v":""},{"$f":"IF(ISBLANK(partije!$P$251),\"\",partije!$P$251)","v":""},{"$f":"IF(ISBLANK(partije!$Q$251),\"\",partije!$Q$251)","v":""},{"$f":"IF(ISBLANK(partije!$R$251),\"\",partije!$R$251)","v":""}]
[52,14,{"$f":"IF(ISNA(MATCH(A105,spisak!$E$4:$E$199,0)),IF(ISNA(MATCH(A105,plasman!$I$3:$I$68,0)),\"bye\",INDEX(plasman!$H$3:$H$68,MATCH(A105,plasman!$I$3:$I$68,0))),INDEX(spisak!$B$4:$B$199,MATCH(A105,spisak!$E$4:$E$199,0)))","v":"bye"},{"$nulls":3},{"$f":"IF(ISNA(MATCH(C105,spisak!$B$4:$B$199,0)),\"\",INDEX(spisak!$C$4:$C$199,MATCH(C105,spisak!$B$4:$B$199,0)))","v":""}]
[null,14,{"$f":"IF(ISNA(MATCH(A106,spisak!$E$4:$E$199,0)),IF(ISNA(MATCH(A106,plasman!$I$3:$I$68,0)),\"bye\",INDEX(plasman!$H$3:$H$68,MATCH(A106,plasman!$I$3:$I$68,0))),INDEX(spisak!$B$4:$B$199,MATCH(A106,spisak!$E$4:$E$199,0)))","v":0},{"$nulls":3},{"$f":"IF(ISNA(MATCH(C106,spisak!$B$4:$B$199,0)),\"\",INDEX(spisak!$C$4:$C$199,MATCH(C106,spisak!$B$4:$B$199,0)))","v":""},null,null,{"$f":"IF(ISBLANK(partije!$L$240),\"\",partije!$L$240)","v":""},{"$f":"IF(ISBLANK(partije!$M$240),\"\",partije!$M$240)","v":""},{"$f":"IF(ISBLANK(partije!$N$240),\"\",partije!$N$240)","v":""},{"$f":"IF(ISBLANK(partije!$O$240),\"\",partije!$O$240)","v":""},{"$f":"IF(ISBLANK(partije!$P$240),\"\",partije!$P$240)","v":""},{"$f":"IF(ISBLANK(partije!$Q$240),\"\",partije!$Q$240)","v":""},{"$f":"IF(ISBLANK(partije!$R$240),\"\",partije!$R$240)","v":""},{"$nulls":7},{"$f":"partije!$S$257","v":"bye"},{"$nulls":4},{"$f":"IF(ISBLANK(partije!$J$257),\"\",IF(partije!$J$257>partije!$K$257,partije!$J$257,partije!$K$257))","v":""},{"$f":"IF(ISBLANK(partije!$J$257),\"\",IF(partije!$J$257>partije!$K$257,partije!$K$257,partije!$J$257))","v":""}]
[53,11,{"$f":"IF(ISNA(MATCH(A107,spisak!$E$4:$E$199,0)),IF(ISNA(MATCH(A107,plasman!$I$3:$I$68,0)),\"bye\",INDEX(plasman!$H$3:$H$68,MATCH(A107,plasman!$I$3:$I$68,0))),INDEX(spisak!$B$4:$B$199,MATCH(A107,spisak!$E$4:$E$199,0)))","v":"bye"},{"$nulls":3},{"$f":"IF(ISNA(MATCH(C107,spisak!$B$4:$B$199,0)),\"\",INDEX(spisak!$C$4:$C$199,MATCH(C107,spisak!$B$4:$B$199,0)))","v":""}]
[null,11,{"$f":"IF(ISNA(MATCH(A108,spisak!$E$4:$E$199,0)),IF(ISNA(MATCH(A108,plasman!$I$3:$I$68,0)),\"bye\",INDEX(plasman!$H$3:$H$68,MATCH(A108,plasman!$I$3:$I$68,0))),INDEX(spisak!$B$4:$B$199,MATCH(A108,spisak!$E$4:$E$199,0)))","v":0},{"$nulls":3},{"$f":"IF(ISNA(MATCH(C108,spisak!$B$4:$B$199,0)),\"\",INDEX(spisak!$C$4:$C$199,MATCH(C108,spisak!$B$4:$B$199,0)))","v":""},null,null,{"$f":"partije!$S$241","v":"bye"},{"$nulls":4},{"$f":"IF(ISBLANK(partije!$J$241),\"\",IF(partije!$J$241>partije!$K$241,partije!$J$241,partije!$K$241))","v":""},{"$f":"IF(ISBLANK(partije!$J$241),\"\",IF(partije!$J$241>partije!$K$241,partije!$K$241,partije!$J$241))","v":""},{"$nulls":7},{"$f":"IF(ISBLANK(partije!$L$257),\"\",partije!$L$257)","v":""},{"$f":"IF(ISBLANK(partije!$M$257),\"\",partije!$M$257)","v":""},{"$f":"IF(ISBLANK(partije!$N$257),\"\",partije!$N$257)","v":""},{"$f":"IF(ISBLANK(partije!$O$257),\"\",partije!$O$257)","v":""},{"$f":"IF(ISBLANK(partije!$P$257),\"\",partije!$P$257)","v":""},{"$f":"IF(ISBLANK(partije!$Q$257),\"\",partije!$Q$257)","v":""},{"$f":"IF(ISBLANK(partije!$R$257),\"\",partije!$R$257)","v":""}]
[54,null,{"$f":"IF(ISNA(MATCH(A109,spisak!$E$4:$E$199,0)),IF(ISNA(MATCH(A109,plasman!$I$3:$I$68,0)),\"bye\",INDEX(plasman!$H$3:$H$68,MATCH(A109,plasman!$I$3:$I$68,0))),INDEX(spisak!$B$4:$B$199,MATCH(A109,spisak!$E$4:$E$199,0)))","v":"bye"},{"$nulls":3},{"$f":"IF(ISNA(MATCH(C109,spisak!$B$4:$B$199,0)),\"\",INDEX(spisak!$C$4:$C$199,MATCH(C109,spisak!$B$4:$B$199,0)))","v":""}]
[null,null,{"$f":"IF(ISNA(MATCH(A110,spisak!$E$4:$E$199,0)),IF(ISNA(MATCH(A110,plasman!$I$3:$I$68,0)),\"bye\",INDEX(plasman!$H$3:$H$68,MATCH(A110,plasman!$I$3:$I$68,0))),INDEX(spisak!$B$4:$B$199,MATCH(A110,spisak!$E$4:$E$199,0)))","v":0},{"$nulls":3},{"$f":"IF(ISNA(MATCH(C110,spisak!$B$4:$B$199,0)),\"\",INDEX(spisak!$C$4:$C$199,MATCH(C110,spisak!$B$4:$B$199,0)))","v":""},null,null,{"$f":"IF(ISBLANK(partije!$L$241),\"\",partije!$L$241)","v":""},{"$f":"IF(ISBLANK(partije!$M$241),\"\",partije!$M$241)","v":""},{"$f":"IF(ISBLANK(partije!$N$241),\"\",partije!$N$241)","v":""},{"$f":"IF(ISBLANK(partije!$O$241),\"\",partije!$O$241)","v":""},{"$f":"IF(ISBLANK(partije!$P$241),\"\",partije!$P$241)","v":""},{"$f":"IF(ISBLANK(partije!$Q$241),\"\",partije!$Q$241)","v":""},{"$f":"IF(ISBLANK(partije!$R$241),\"\",partije!$R$241)","v":""},{"$f":"partije!$S$252","v":"bye"},{"$nulls":4},{"$f":"IF(ISBLANK(partije!$J$252),\"\",IF(partije!$J$252>partije!$K$252,partije!$J$252,partije!$K$252))","v":""},{"$f":"IF(ISBLANK(partije!$J$252),\"\",IF(partije!$J$252>partije!$K$252,partije!$K$252,partije!$J$252))","v":""}]
[55,null,{"$f":"IF(ISNA(MATCH(A111,spisak!$E$4:$E$199,0)),IF(ISNA(MATCH(A111,plasman!$I$3:$I$68,0)),\"bye\",INDEX(plasman!$H$3:$H$68,MATCH(A111,plasman!$I$3:$I$68,0))),INDEX(spisak!$B$4:$B$199,MATCH(A111,spisak!$E$4:$E$199,0)))","v":"bye"},{"$nulls":3},{"$f":"IF(ISNA(MATCH(C111,spisak!$B$4:$B$199,0)),\"\",INDEX(spisak!$C$4:$C$199,MATCH(C111,spisak!$B$4:$B$199,0)))","v":""}]
[null,null,{"$f":"IF(ISNA(MATCH(A112,spisak!$E$4:$E$199,0)),IF(ISNA(MATCH(A112,plasman!$I$3:$I$68,0)),\"bye\",INDEX(plasman!$H$3:$H$68,MATCH(A112,plasman!$I$3:$I$68,0))),INDEX(spisak!$B$4:$B$199,MATCH(A112,spisak!$E$4:$E$199,0)))","v":0},{"$nulls":3},{"$f":"IF(ISNA(MATCH(C112,spisak!$B$4:$B$199,0)),\"\",INDEX(spisak!$C$4:$C$199,MATCH(C112,spisak!$B$4:$B$199,0)))","v":""},null,null,{"$f":"partije!$S$242","v":"bye"},{"$nulls":4},{"$f":"IF(ISBLANK(partije!$J$242),\"\",IF(partije!$J$242>partije!$K$242,partije!$J$242,partije!$K$242))","v":""},{"$f":"IF(ISBLANK(partije!$J$242),\"\",IF(partije!$J$242>partije!$K$242,partije!$K$242,partije!$J$242))","v":""},{"$f":"IF(ISBLANK(partije!$L$252),\"\",partije!$L$252)","v":""},{"$f":"IF(ISBLANK(partije!$M$252),\"\",partije!$M$252)","v":""},{"$f":"IF(ISBLANK(partije!$N$252),\"\",partije!$N$252)","v":""},{"$f":"IF(ISBLANK(partije!$O$252),\"\",partije!$O$252)","v":""},{"$f":"IF(ISBLANK(partije!$P$252),\"\",partije!$P$252)","v":""},{"$f":"IF(ISBLANK(partije!$Q$252),\"\",partije!$Q$252)","v":""},{"$f":"IF(ISBLANK(partije!$R$252),\"\",partije!$R$252)","v":""}]
[56,6,{"$f":"IF(ISNA(MATCH(A113,spisak!$E$4:$E$199,0)),IF(ISNA(MATCH(A113,plasman!$I$3:$I$68,0)),\"bye\",INDEX(plasman!$H$3:$H$68,MATCH(A113,plasman!$I$3:$I$68,0))),INDEX(spisak!$B$4:$B$199,MATCH(A113,spisak!$E$4:$E$199,0)))","v":"bye"},{"$nulls":3},{"$f":"IF(ISNA(MATCH(C113,spisak!$B$4:$B$199,0)),\"\",INDEX(spisak!$C$4:$C$199,MATCH(C113,spisak!$B$4:$B$199,0)))","v":""}]
[null,6,{"$f":"IF(ISNA(MATCH(A114,spisak!$E$4:$E$199,0)),IF(ISNA(MATCH(A114,plasman!$I$3:$I$68,0)),\"bye\",INDEX(plasman!$H$3:$H$68,MATCH(A114,plasman!$I$3:$I$68,0))),INDEX(spisak!$B$4:$B$199,MATCH(A114,spisak!$E$4:$E$199,0)))","v":0},{"$nulls":3},{"$f":"IF(ISNA(MATCH(C114,spisak!$B$4:$B$199,0)),\"\",INDEX(spisak!$C$4:$C$199,MATCH(C114,spisak!$B$4:$B$199,0)))","v":""},null,null,{"$f":"IF(ISBLANK(partije!$L$242),\"\",partije!$L$242)","v":""},{"$f":"IF(ISBLANK(partije!$M$242),\"\",partije!$M$242)","v":""},{"$f":"IF(ISBLANK(partije!$N$242),\"\",partije!$N$242)","v":""},{"$f":"IF(ISBLANK(partije!$O$242),\"\",partije!$O$242)","v":""},{"$f":"IF(ISBLANK(partije!$P$242),\"\",partije!$P$242)","v":""},{"$f":"IF(ISBLANK(partije!$Q$242),\"\",partije!$Q$242)","v":""},{"$f":"IF(ISBLANK(partije!$R$242),\"\",partije!$R$242)","v":""}]
[57,7,{"$f":"IF(ISNA(MATCH(A115,spisak!$E$4:$E$199,0)),IF(ISNA(MATCH(A115,plasman!$I$3:$I$68,0)),\"bye\",INDEX(plasman!$H$3:$H$68,MATCH(A115,plasman!$I$3:$I$68,0))),INDEX(spisak!$B$4:$B$199,MATCH(A115,spisak!$E$4:$E$199,0)))","v":"bye"},{"$nulls":3},{"$f":"IF(ISNA(MATCH(C115,spisak!$B$4:$B$199,0)),\"\",INDEX(spisak!$C$4:$C$199,MATCH(C115,spisak!$B$4:$B$199,0)))","v":""},{"$nulls":23},{"$f":"partije!$S$260","v":"bye"},{"$nulls":4},{"$f":"IF(ISBLANK(partije!$J$260),\"\",IF(partije!$J$260>partije!$K$260,partije!$J$260,partije!$K$260))","v":""},{"$f":"IF(ISBLANK(partije!$J$260),\"\",IF(partije!$J$260>partije!$K$260,partije!$K$260,partije!$J$260))","v":""}]
[null,7,{"$f":"IF(ISNA(MATCH(A116,spisak!$E$4:$E$199,0)),IF(ISNA(MATCH(A116,plasman!$I$3:$I$68,0)),\"bye\",INDEX(plasman!$H$3:$H$68,MATCH(A116,plasman!$I$3:$I$68,0))),INDEX(spisak!$B$4:$B$199,MATCH(A116,spisak!$E$4:$E$199,0)))","v":0},{"$nulls":3},{"$f":"IF(ISNA(MATCH(C116,spisak!$B$4:$B$199,0)),\"\",INDEX(spisak!$C$4:$C$199,MATCH(C116,spisak!$B$4:$B$199,0)))","v":""},null,null,{"$f":"partije!$S$243","v":"bye"},{"$nulls":4},{"$f":"IF(ISBLANK(partije!$J$243),\"\",IF(partije!$J$243>partije!$K$243,partije!$J$243,partije!$K$243))","v":""},{"$f":"IF(ISBLANK(partije!$J$243),\"\",IF(partije!$J$243>partije!$K$243,partije!$K$243,partije!$J$243))","v":""}]
[58,null,{"$f":"IF(ISNA(MATCH(A117,spisak!$E$4:$E$199,0)),IF(ISNA(MATCH(A117,plasman!$I$3:$I$68,0)),\"bye\",INDEX(plasman!$H$3:$H$68,MATCH(A117,plasman!$I$3:$I$68,0))),INDEX(spisak!$B$4:$B$199,MATCH(A117,spisak!$E$4:$E$199,0)))","v":"bye"},{"$nulls":3},{"$f":"IF(ISNA(MATCH(C117,spisak!$B$4:$B$199,0)),\"\",INDEX(spisak!$C$4:$C$199,MATCH(C117,spisak!$B$4:$B$199,0)))","v":""},{"$nulls":23},{"$f":"IF(ISBLANK(partije!$L$260),\"\",partije!$L$260)","v":""},{"$f":"IF(ISBLANK(partije!$M$260),\"\",partije!$M$260)","v":""},{"$f":"IF(ISBLANK(partije!$N$260),\"\",partije!$N$260)","v":""},{"$f":"IF(ISBLANK(partije!$O$260),\"\",partije!$O$260)","v":""},{"$f":"IF(ISBLANK(partije!$P$260),\"\",partije!$P$260)","v":""},{"$f":"IF(ISBLANK(partije!$Q$260),\"\",partije!$Q$260)","v":""},{"$f":"IF(ISBLANK(partije!$R$260),\"\",partije!$R$260)","v":""}]
[null,null,{"$f":"IF(ISNA(MATCH(A118,spisak!$E$4:$E$199,0)),IF(ISNA(MATCH(A118,plasman!$I$3:$I$68,0)),\"bye\",INDEX(plasman!$H$3:$H$68,MATCH(A118,plasman!$I$3:$I$68,0))),INDEX(spisak!$B$4:$B$199,MATCH(A118,spisak!$E$4:$E$199,0)))","v":0},{"$nulls":3},{"$f":"IF(ISNA(MATCH(C118,spisak!$B$4:$B$199,0)),\"\",INDEX(spisak!$C$4:$C$199,MATCH(C118,spisak!$B$4:$B$199,0)))","v":""},null,null,{"$f":"IF(ISBLANK(partije!$L$243),\"\",partije!$L$243)","v":""},{"$f":"IF(ISBLANK(partije!$M$243),\"\",partije!$M$243)","v":""},{"$f":"IF(ISBLANK(partije!$N$243),\"\",partije!$N$243)","v":""},{"$f":"IF(ISBLANK(partije!$O$243),\"\",partije!$O$243)","v":""},{"$f":"IF(ISBLANK(partije!$P$243),\"\",partije!$P$243)","v":""},{"$f":"IF(ISBLANK(partije!$Q$243),\"\",partije!$Q$243)","v":""},{"$f":"IF(ISBLANK(partije!$R$243),\"\",partije!$R$243)","v":""},{"$f":"partije!$S$253","v":"bye"},{"$nulls":4},{"$f":"IF(ISBLANK(partije!$J$253),\"\",IF(partije!$J$253>partije!$K$253,partije!$J$253,partije!$K$253))","v":""},{"$f":"IF(ISBLANK(partije!$J$253),\"\",IF(partije!$J$253>partije!$K$253,partije!$K$253,partije!$J$253))","v":""}]
[59,null,{"$f":"IF(ISNA(MATCH(A119,spisak!$E$4:$E$199,0)),IF(ISNA(MATCH(A119,plasman!$I$3:$I$68,0)),\"bye\",INDEX(plasman!$H$3:$H$68,MATCH(A119,plasman!$I$3:$I$68,0))),INDEX(spisak!$B$4:$B$199,MATCH(A119,spisak!$E$4:$E$199,0)))","v":"bye"},{"$nulls":3},{"$f":"IF(ISNA(MATCH(C119,spisak!$B$4:$B$199,0)),\"\",INDEX(spisak!$C$4:$C$199,MATCH(C119,spisak!$B$4:$B$199,0)))","v":""}]
[null,null,{"$f":"IF(ISNA(MATCH(A120,spisak!$E$4:$E$199,0)),IF(ISNA(MATCH(A120,plasman!$I$3:$I$68,0)),\"bye\",INDEX(plasman!$H$3:$H$68,MATCH(A120,plasman!$I$3:$I$68,0))),INDEX(spisak!$B$4:$B$199,MATCH(A120,spisak!$E$4:$E$199,0)))","v":0},{"$nulls":3},{"$f":"IF(ISNA(MATCH(C120,spisak!$B$4:$B$199,0)),\"\",INDEX(spisak!$C$4:$C$199,MATCH(C120,spisak!$B$4:$B$199,0)))","v":""},null,null,{"$f":"partije!$S$244","v":"bye"},{"$nulls":4},{"$f":"IF(ISBLANK(partije!$J$244),\"\",IF(partije!$J$244>partije!$K$244,partije!$J$244,partije!$K$244))","v":""},{"$f":"IF(ISBLANK(partije!$J$244),\"\",IF(partije!$J$244>partije!$K$244,partije!$K$244,partije!$J$244))","v":""},{"$f":"IF(ISBLANK(partije!$L$253),\"\",partije!$L$253)","v":""},{"$f":"IF(ISBLANK(partije!$M$253),\"\",partije!$M$253)","v":""},{"$f":"IF(ISBLANK(partije!$N$253),\"\",partije!$N$253)","v":""},{"$f":"IF(ISBLANK(partije!$O$253),\"\",partije!$O$253)","v":""},{"$f":"IF(ISBLANK(partije!$P$253),\"\",partije!$P$253)","v":""},{"$f":"IF(ISBLANK(partije!$Q$253),\"\",partije!$Q$253)","v":""},{"$f":"IF(ISBLANK(partije!$R$253),\"\",partije!$R$253)","v":""}]
[60,10,{"$f":"IF(ISNA(MATCH(A121,spisak!$E$4:$E$199,0)),IF(ISNA(MATCH(A121,plasman!$I$3:$I$68,0)),\"bye\",INDEX(plasman!$H$3:$H$68,MATCH(A121,plasman!$I$3:$I$68,0))),INDEX(spisak!$B$4:$B$199,MATCH(A121,spisak!$E$4:$E$199,0)))","v":"bye"},{"$nulls":3},{"$f":"IF(ISNA(MATCH(C121,spisak!$B$4:$B$199,0)),\"\",INDEX(spisak!$C$4:$C$199,MATCH(C121,spisak!$B$4:$B$199,0)))","v":""}]
[null,10,{"$f":"IF(ISNA(MATCH(A122,spisak!$E$4:$E$199,0)),IF(ISNA(MATCH(A122,plasman!$I$3:$I$68,0)),\"bye\",INDEX(plasman!$H$3:$H$68,MATCH(A122,plasman!$I$3:$I$68,0))),INDEX(spisak!$B$4:$B$199,MATCH(A122,spisak!$E$4:$E$199,0)))","v":0},{"$nulls":3},{"$f":"IF(ISNA(MATCH(C122,spisak!$B$4:$B$199,0)),\"\",INDEX(spisak!$C$4:$C$199,MATCH(C122,spisak!$B$4:$B$199,0)))","v":""},null,null,{"$f":"IF(ISBLANK(partije!$L$244),\"\",partije!$L$244)","v":""},{"$f":"IF(ISBLANK(partije!$M$244),\"\",partije!$M$244)","v":""},{"$f":"IF(ISBLANK(partije!$N$244),\"\",partije!$N$244)","v":""},{"$f":"IF(ISBLANK(partije!$O$244),\"\",partije!$O$244)","v":""},{"$f":"IF(ISBLANK(partije!$P$244),\"\",partije!$P$244)","v":""},{"$f":"IF(ISBLANK(partije!$Q$244),\"\",partije!$Q$244)","v":""},{"$f":"IF(ISBLANK(partije!$R$244),\"\",partije!$R$244)","v":""},{"$nulls":7},{"$f":"partije!$S$258","v":"bye"},{"$nulls":4},{"$f":"IF(ISBLANK(partije!$J$258),\"\",IF(partije!$J$258>partije!$K$258,partije!$J$258,partije!$K$258))","v":""},{"$f":"IF(ISBLANK(partije!$J$258),\"\",IF(partije!$J$258>partije!$K$258,partije!$K$258,partije!$J$258))","v":""}]
[61,15,{"$f":"IF(ISNA(MATCH(A123,spisak!$E$4:$E$199,0)),IF(ISNA(MATCH(A123,plasman!$I$3:$I$68,0)),\"bye\",INDEX(plasman!$H$3:$H$68,MATCH(A123,plasman!$I$3:$I$68,0))),INDEX(spisak!$B$4:$B$199,MATCH(A123,spisak!$E$4:$E$199,0)))","v":"bye"},{"$nulls":3},{"$f":"IF(ISNA(MATCH(C123,spisak!$B$4:$B$199,0)),\"\",INDEX(spisak!$C$4:$C$199,MATCH(C123,spisak!$B$4:$B$199,0)))","v":""}]
[null,15,{"$f":"IF(ISNA(MATCH(A124,spisak!$E$4:$E$199,0)),IF(ISNA(MATCH(A124,plasman!$I$3:$I$68,0)),\"bye\",INDEX(plasman!$H$3:$H$68,MATCH(A124,plasman!$I$3:$I$68,0))),INDEX(spisak!$B$4:$B$199,MATCH(A124,spisak!$E$4:$E$199,0)))","v":0},{"$nulls":3},{"$f":"IF(ISNA(MATCH(C124,spisak!$B$4:$B$199,0)),\"\",INDEX(spisak!$C$4:$C$199,MATCH(C124,spisak!$B$4:$B$199,0)))","v":""},null,null,{"$f":"partije!$S$245","v":"bye"},{"$nulls":4},{"$f":"IF(ISBLANK(partije!$J$245),\"\",IF(partije!$J$245>partije!$K$245,partije!$J$245,partije!$K$245))","v":""},{"$f":"IF(ISBLANK(partije!$J$245),\"\",IF(partije!$J$245>partije!$K$245,partije!$K$245,partije!$J$245))","v":""},{"$nulls":7},{"$f":"IF(ISBLANK(partije!$L$258),\"\",partije!$L$258)","v":""},{"$f":"IF(ISBLANK(partije!$M$258),\"\",partije!$M$258)","v":""},{"$f":"IF(ISBLANK(partije!$N$258),\"\",partije!$N$258)","v":""},{"$f":"IF(ISBLANK(partije!$O$258),\"\",partije!$O$258)","v":""},{"$f":"IF(ISBLANK(partije!$P$258),\"\",partije!$P$258)","v":""},{"$f":"IF(ISBLANK(partije!$Q$258),\"\",partije!$Q$258)","v":""},{"$f":"IF(ISBLANK(partije!$R$258),\"\",partije!$R$258)","v":""}]
[62,null,{"$f":"IF(ISNA(MATCH(A125,spisak!$E$4:$E$199,0)),IF(ISNA(MATCH(A125,plasman!$I$3:$I$68,0)),\"bye\",INDEX(plasman!$H$3:$H$68,MATCH(A125,plasman!$I$3:$I$68,0))),INDEX(spisak!$B$4:$B$199,MATCH(A125,spisak!$E$4:$E$199,0)))","v":"bye"},{"$nulls":3},{"$f":"IF(ISNA(MATCH(C125,spisak!$B$4:$B$199,0)),\"\",INDEX(spisak!$C$4:$C$199,MATCH(C125,spisak!$B$4:$B$199,0)))","v":""}]
[null,null,{"$f":"IF(ISNA(MATCH(A126,spisak!$E$4:$E$199,0)),IF(ISNA(MATCH(A126,plasman!$I$3:$I$68,0)),\"bye\",INDEX(plasman!$H$3:$H$68,MATCH(A126,plasman!$I$3:$I$68,0))),INDEX(spisak!$B$4:$B$199,MATCH(A126,spisak!$E$4:$E$199,0)))","v":0},{"$nulls":3},{"$f":"IF(ISNA(MATCH(C126,spisak!$B$4:$B$199,0)),\"\",INDEX(spisak!$C$4:$C$199,MATCH(C126,spisak!$B$4:$B$199,0)))","v":""},null,null,{"$f":"IF(ISBLANK(partije!$L$245),\"\",partije!$L$245)","v":""},{"$f":"IF(ISBLANK(partije!$M$245),\"\",partije!$M$245)","v":""},{"$f":"IF(ISBLANK(partije!$N$245),\"\",partije!$N$245)","v":""},{"$f":"IF(ISBLANK(partije!$O$245),\"\",partije!$O$245)","v":""},{"$f":"IF(ISBLANK(partije!$P$245),\"\",partije!$P$245)","v":""},{"$f":"IF(ISBLANK(partije!$Q$245),\"\",partije!$Q$245)","v":""},{"$f":"IF(ISBLANK(partije!$R$245),\"\",partije!$R$245)","v":""},{"$f":"partije!$S$254","v":"bye"},{"$nulls":4},{"$f":"IF(ISBLANK(partije!$J$254),\"\",IF(partije!$J$254>partije!$K$254,partije!$J$254,partije!$K$254))","v":""},{"$f":"IF(ISBLANK(partije!$J$254),\"\",IF(partije!$J$254>partije!$K$254,partije!$K$254,partije!$J$254))","v":""}]
[63,null,{"$f":"IF(ISNA(MATCH(A127,spisak!$E$4:$E$199,0)),IF(ISNA(MATCH(A127,plasman!$I$3:$I$68,0)),\"bye\",INDEX(plasman!$H$3:$H$68,MATCH(A127,plasman!$I$3:$I$68,0))),INDEX(spisak!$B$4:$B$199,MATCH(A127,spisak!$E$4:$E$199,0)))","v":"bye"},{"$nulls":3},{"$f":"IF(ISNA(MATCH(C127,spisak!$B$4:$B$199,0)),\"\",INDEX(spisak!$C$4:$C$199,MATCH(C127,spisak!$B$4:$B$199,0)))","v":""}]
[null,null,{"$f":"IF(ISNA(MATCH(A128,spisak!$E$4:$E$199,0)),IF(ISNA(MATCH(A128,plasman!$I$3:$I$68,0)),\"bye\",INDEX(plasman!$H$3:$H$68,MATCH(A128,plasman!$I$3:$I$68,0))),INDEX(spisak!$B$4:$B$199,MATCH(A128,spisak!$E$4:$E$199,0)))","v":0},{"$nulls":3},{"$f":"IF(ISNA(MATCH(C128,spisak!$B$4:$B$199,0)),\"\",INDEX(spisak!$C$4:$C$199,MATCH(C128,spisak!$B$4:$B$199,0)))","v":""},null,null,{"$f":"partije!$S$246","v":"bye"},{"$nulls":4},{"$f":"IF(ISBLANK(partije!$J$246),\"\",IF(partije!$J$246>partije!$K$246,partije!$J$246,partije!$K$246))","v":""},{"$f":"IF(ISBLANK(partije!$J$246),\"\",IF(partije!$J$246>partije!$K$246,partije!$K$246,partije!$J$246))","v":""},{"$f":"IF(ISBLANK(partije!$L$254),\"\",partije!$L$254)","v":""},{"$f":"IF(ISBLANK(partije!$M$254),\"\",partije!$M$254)","v":""},{"$f":"IF(ISBLANK(partije!$N$254),\"\",partije!$N$254)","v":""},{"$f":"IF(ISBLANK(partije!$O$254),\"\",partije!$O$254)","v":""},{"$f":"IF(ISBLANK(partije!$P$254),\"\",partije!$P$254)","v":""},{"$f":"IF(ISBLANK(partije!$Q$254),\"\",partije!$Q$254)","v":""},{"$f":"IF(ISBLANK(partije!$R$254),\"\",partije!$R$254)","v":""}]
[64,2,{"$f":"IF(ISNA(MATCH(A129,spisak!$E$4:$E$199,0)),IF(ISNA(MATCH(A129,plasman!$I$3:$I$68,0)),\"bye\",INDEX(plasman!$H$3:$H$68,MATCH(A129,plasman!$I$3:$I$68,0))),INDEX(spisak!$B$4:$B$199,MATCH(A129,spisak!$E$4:$E$199,0)))","v":"bye"},{"$nulls":3},{"$f":"IF(ISNA(MATCH(C129,spisak!$B$4:$B$199,0)),\"\",INDEX(spisak!$C$4:$C$199,MATCH(C129,spisak!$B$4:$B$199,0)))","v":""}]
[null,null,{"$f":"IF(ISNA(MATCH(A130,spisak!$E$4:$E$199,0)),IF(ISNA(MATCH(A130,plasman!$I$3:$I$68,0)),\"bye\",INDEX(plasman!$H$3:$H$68,MATCH(A130,plasman!$I$3:$I$68,0))),INDEX(spisak!$B$4:$B$199,MATCH(A130,spisak!$E$4:$E$199,0)))","v":0},{"$nulls":3},{"$f":"IF(ISNA(MATCH(C130,spisak!$B$4:$B$199,0)),\"\",INDEX(spisak!$C$4:$C$199,MATCH(C130,spisak!$B$4:$B$199,0)))","v":""},null,null,{"$f":"IF(ISBLANK(partije!$L$246),\"\",partije!$L$246)","v":""},{"$f":"IF(ISBLANK(partije!$M$246),\"\",partije!$M$246)","v":""},{"$f":"IF(ISBLANK(partije!$N$246),\"\",partije!$N$246)","v":""},{"$f":"IF(ISBLANK(partije!$O$246),\"\",partije!$O$246)","v":""},{"$f":"IF(ISBLANK(partije!$P$246),\"\",partije!$P$246)","v":""},{"$f":"IF(ISBLANK(partije!$Q$246),\"\",partije!$Q$246)","v":""},{"$f":"IF(ISBLANK(partije!$R$246),\"\",partije!$R$246)","v":""}]
[]
[{"$f":"CONCATENATE(info!C6,\", \",info!C5)","v":"Niš, 02.2.2019."},{"$nulls":36},{"$f":"info!C7","v":"RSTSN"}]

{"sheet":"partije","index":5,"n_rows":284,"n_cols":32,"rows_kept":284,"merged":[[0,9,0,10]]}
["id","kolo","grupa","vreme","sto","igrač",null,"igrač",null,"rezultat",null,"1. set","2. set","3. set","4. set","5. set","6. set","7. set",null,null,1,3,5,7,9,11,134,220,null,null,254,255]
[1,"q1",1,null,null,{"$f":"grupe!C10","v":"Ilić Bogdan"},{"$f":"IF(F2=\"bye\",\"\",INDEX(spisak!$C$4:$C$308,MATCH(F2,spisak!$B$4:$B$542,0)))","v":"Napad"},{"$f":"grupe!D10","v":"Zaharijev  Nikola"},{"$f":"IF(H2=\"bye\",\"\",INDEX(spisak!$C$4:$C$308,MATCH(H2,spisak!$B$4:$B$542,0)))","v":"Mladost Bosilegrad"},3,0,{"v":1104,"d":"11-04"},{"v":1102,"d":"11-02"},{"v":1108,"d":"11-08"},{"$nulls":4},{"$f":"IF(ISBLANK(J2),\"\",IF(J2>K2,F2,H2))","v":"Ilić Bogdan"}]
[2,"q1",1,null,null,{"$f":"grupe!C11","v":"Ivančev Đorđe"},{"$f":"IF(F3=\"bye\",\"\",INDEX(spisak!$C$4:$C$308,MATCH(F3,spisak!$B$4:$B$542,0)))","v":"Sinđelić Beograd"},{"$f":"grupe!D11","v":"bye"},{"$f":"IF(H3=\"bye\",\"\",INDEX(spisak!$C$4:$C$308,MATCH(H3,spisak!$B$4:$B$542,0)))","v":""},{"$nulls":9},""]
[3,"q1",2,null,null,{"$f":"grupe!C24","v":"Šepa Matija"},{"$f":"IF(F4=\"bye\",\"\",INDEX(spisak!$C$4:$C$308,MATCH(F4,spisak!$B$4:$B$542,0)))","v":"Stak Zemun"},{"$f":"grupe!D24","v":"Jović Aleksandar"},{"$f":"IF(H4=\"bye\",\"\",INDEX(spisak!$C$4:$C$308,MATCH(H4,spisak!$B$4:$B$542,0)))","v":"Dubočica Leskovac"},3,0,{"v":1104,"d":"11-04"},{"v":1102,"d":"11-02"},{"v":1106,"d":"11-06"},{"$nulls":4},"Šepa Matija"]
[4,"q1",2,null,null,{"$f":"grupe!C25","v":"Putnik Dario"},{"$f":"IF(F5=\"bye\",\"\",INDEX(spisak!$C$4:$C$308,MATCH(F5,spisak!$B$4:$B$542,0)))","v":"Milenijum"},{"$f":"grupe!D25","v":"bye"},{"$f":"IF(H5=\"bye\",\"\",INDEX(spisak!$C$4:$C$308,MATCH(H5,spisak!$B$4:$B$542,0)))","v":""},{"$nulls":9},""]
[5,"q1",3,null,null,{"$f":"grupe!C38","v":"Stefanović Vanja"},{"$f":"IF(F6=\"bye\",\"\",INDEX(spisak!$C$4:$C$308,MATCH(F6,spisak!$B$4:$B$542,0)))","v":"Stak Zemun"},{"$f":"grupe!D38","v":"Velinović Miloš"},{"$f":"IF(H6=\"bye\",\"\",INDEX(spisak!$C$4:$C$308,MATCH(H6,spisak!$B$4:$B$542,0)))","v":"Belo Polje"},3,0,{"v":1102,"d":"11-02"},{"v":1104,"d":"11-04"},{"v":1103,"d":"11-03"},{"$nulls":4},"Stefanović Vanja"]
[6,"q1",3,null,null,{"$f":"grupe!C39","v":"Kalinić Ilija"},{"$f":"IF(F7=\"bye\",\"\",INDEX(spisak!$C$4:$C$308,MATCH(F7,spisak!$B$4:$B$542,0)))","v":"Ugrinovci"},{"$f":"grupe!D39","v":"bye"},{"$f":"IF(H7=\"bye\",\"\",INDEX(spisak!$C$4:$C$308,MATCH(H7,spisak!$B$4:$B$542,0)))","v":""},{"$nulls":9},""]
[7,"q1",4,null,null,{"$f":"grupe!C52","v":"Pavlović Dušan"},{"$f":"IF(F8=\"bye\",\"\",INDEX(spisak!$C$4:$C$308,MATCH(F8,spisak!$B$4:$B$542,0)))","v":"Stak Zemun"},{"$f":"grupe!D52","v":"Dragin Luka"},{"$f":"IF(H8=\"bye\",\"\",INDEX(spisak!$C$4:$C$308,MATCH(H8,spisak!$B$4:$B$542,0)))","v":"Borac Čačak"},3,0,{"v":1103,"d":"11-03"},{"v":1102,"d":"11-02"},{"v":1101,"d":"11-01"},{"$nulls":4},"Pavlović Dušan"]
[8,"q1",4,null,null,{"$f":"grupe!C53","v":"Miovčić Mihailo"},{"$f":"IF(F9=\"bye\",\"\",INDEX(spisak!$C$4:$C$308,MATCH(F9,spisak!$B$4:$B$542,0)))","v":"Sinđelić Beograd"},{"$f":"grupe!D53","v":"bye"},{"$f":"IF(H9=\"bye\",\"\",INDEX(spisak!$C$4:$C$308,MATCH(H9,spisak!$B$4:$B$542,0)))","v":""},{"$nulls":9},""]
[9,"q1",5,null,null,{"$f":"grupe!C66","v":"Jelikić Dimitrije"},{"$f":"IF(F10=\"bye\",\"\",INDEX(spisak!$C$4:$C$308,MATCH(F10,spisak!$B$4:$B$542,0)))","v":"Crvena Zvezda Beograd"},{"$f":"grupe!D66","v":"Janićijević Ognjen"},{"$f":"IF(H10=\"bye\",\"\",INDEX(spisak!$C$4:$C$308,MATCH(H10,spisak!$B$4:$B$542,0)))","v":"Lala"},3,0,{"v":1104,"d":"11-04"},{"v":1102,"d":"11-02"},{"v":1103,"d":"11-03"},{"$nulls":4},"Jelikić Dimitrije"]
[10,"q1",5,null,null,{"$f":"grupe!C67","v":"Kalinčević Vladimir"},{"$f":"IF(F11=\"bye\",\"\",INDEX(spisak!$C$4:$C$308,MATCH(F11,spisak!$B$4:$B$542,0)))","v":"Sinđelić Beograd"},{"$f":"grupe!D67","v":"bye"},{"$f":"IF(H11=\"bye\",\"\",INDEX(spisak!$C$4:$C$308,MATCH(H11,spisak!$B$4:$B$542,0)))","v":""},{"$nulls":9},""]
[11,"q1",6,null,null,{"$f":"grupe!C80","v":"Varga Danijel"},{"$f":"IF(F12=\"bye\",\"\",INDEX(spisak!$C$4:$C$308,MATCH(F12,spisak!$B$4:$B$542,0)))","v":"Temerin"},{"$f":"grupe!D80","v":"Preslav Nikolov"},{"$f":"IF(H12=\"bye\",\"\",INDEX(spisak!$C$4:$C$308,MATCH(H12,spisak!$B$4:$B$542,0)))","v":"Bdinci Bugarska"},3,0,{"v":1105,"d":"11-05"},{"v":1104,"d":"11-04"},{"v":1106,"d":"11-06"},{"$nulls":4},"Varga Danijel"]
[12,"q1",6,null,null,{"$f":"grupe!C81","v":"Marton Filip"},{"$f":"IF(F13=\"bye\",\"\",INDEX(spisak!$C$4:$C$308,MATCH(F13,spisak!$B$4:$B$542,0)))","v":"Doža"},{"$f":"grupe!D81","v":"bye"},{"$f":"IF(H13=\"bye\",\"\",INDEX(spisak!$C$4:$C$308,MATCH(H13,spisak!$B$4:$B$542,0)))","v":""},{"$nulls":9},""]
[13,"q1",7,null,null,{"$f":"grupe!C94","v":"Pavlović Dimitrije"},{"$f":"IF(F14=\"bye\",\"\",INDEX(spisak!$C$4:$C$308,MATCH(F14,spisak!$B$4:$B$542,0)))","v":"Stak Zemun"},{"$f":"grupe!D94","v":"Živadinović Dimitrije"},{"$f":"IF(H14=\"bye\",\"\",INDEX(spisak!$C$4:$C$308,MATCH(H14,spisak!$B$4:$B$542,0)))","v":"Železničar Niš"},"w",0,{"$nulls":7},"Pavlović Dimitrije"]
[14,"q1",7,null,null,{"$f":"grupe!C95","v":"Dragin Saša"},{"$f":"IF(F15=\"bye\",\"\",INDEX(spisak!$C$4:$C$308,MATCH(F15,spisak!$B$4:$B$542,0)))","v":"Borac Čačak"},{"$f":"grupe!D95","v":"bye"},{"$f":"IF(H15=\"bye\",\"\",INDEX(spisak!$C$4:$C$308,MATCH(H15,spisak!$B$4:$B$542,0)))","v":""},{"$nulls":9},""]
[15,"q1",8,null,null,{"$f":"grupe!C108","v":"Bošković Marko"},{"$f":"IF(F16=\"bye\",\"\",INDEX(spisak!$C$4:$C$308,MATCH(F16,spisak!$B$4:$B$542,0)))","v":"Stak Zemun"},{"$f":"grupe!D108","v":"Titovski Nenad"},{"$f":"IF(H16=\"bye\",\"\",INDEX(spisak!$C$4:$C$308,MATCH(H16,spisak!$B$4:$B$542,0)))","v":"Skoplje"},3,0,{"v":1106,"d":"11-06"},{"v":1105,"d":"11-05"},{"v":1101,"d":"11-01"},{"$nulls":4},"Bošković Marko"]
[16,"q1",8,null,null,{"$f":"grupe!C109","v":"Mladenović Ognjen"},{"$f":"IF(F17=\"bye\",\"\",INDEX(spisak!$C$4:$C$308,MATCH(F17,spisak!$B$4:$B$542,0)))","v":"Prva Petoletka"},{"$f":"grupe!D109","v":"bye"},{"$f":"IF(H17=\"bye\",\"\",INDEX(spisak!$C$4:$C$308,MATCH(H17,spisak!$B$4:$B$542,0)))","v":""},{"$nulls":9},""]
[17,"q1",9,null,null,{"$f":"grupe!C122","v":"Ninković Uroš"},{"$f":"IF(F18=\"bye\",\"\",INDEX(spisak!$C$4:$C$308,MATCH(F18,spisak!$B$4:$B$542,0)))","v":"Stak Zemun"},{"$f":"grupe!D122","v":"Lazić Nemanja"},{"$f":"IF(H18=\"bye\",\"\",INDEX(spisak!$C$4:$C$308,MATCH(H18,spisak!$B$4:$B$542,0)))","v":"Lala"},3,0,{"v":1105,"d":"11-05"},{"v":1104,"d":"11-04"},{"v":1105,"d":"11-05"},{"$nulls":4},"Ninković Uroš"]
[18,"q1",9,null,null,{"$f":"grupe!C123","v":"Jovanović Đurađ"},{"$f":"IF(F19=\"bye\",\"\",INDEX(spisak!$C$4:$C$308,MATCH(F19,spisak!$B$4:$B$542,0)))","v":"Sinđelić Beograd"},{"$f":"grupe!D123","v":"bye"},{"$f":"IF(H19=\"bye\",\"\",INDEX(spisak!$C$4:$C$308,MATCH(H19,spisak!$B$4:$B$542,0)))","v":""},{"$nulls":9},""]
[19,"q1",10,null,null,{"$f":"grupe!C136","v":"Rajić Borislav"},{"$f":"IF(F20=\"bye\",\"\",INDEX(spisak!$C$4:$C$308,MATCH(F20,spisak!$B$4:$B$542,0)))","v":"Novi Sad"},{"$f":"grupe!D136","v":"Ivailo Bojanov"},{"$f":"IF(H20=\"bye\",\"\",INDEX(spisak!$C$4:$C$308,MATCH(H20,spisak!$B$4:$B$542,0)))","v":"Bdinci Bugarska"},3,0,{"v":1106,"d":"11-06"},{"v":1104,"d":"11-04"},{"v":1105,"d":"11-05"},{"$nulls":4},"Rajić Borislav"]
[20,"q1",10,null,null,{"$f":"grupe!C137","v":"Konstantinov Marko"},{"$f":"IF(F21=\"bye\",\"\",INDEX(spisak!$C$4:$C$308,MATCH(F21,spisak!$B$4:$B$542,0)))","v":"Vršac"},{"$f":"grupe!D137","v":"bye"},{"$f":"IF(H21=\"bye\",\"\",INDEX(spisak!$C$4:$C$308,MATCH(H21,spisak!$B$4:$B$542,0)))","v":""},{"$nulls":9},""]
[21,"q1",11,null,null,{"$f":"grupe!C150","v":"Marinković Vasilije"},{"$f":"IF(F22=\"bye\",\"\",INDEX(spisak!$C$4:$C$308,MATCH(F22,spisak!$B$4:$B$542,0)))","v":"Barajevo"},{"$f":"grupe!D150","v":"Orolić Đorđe"},{"$f":"IF(H22=\"bye\",\"\",INDEX(spisak!$C$4:$C$308,MATCH(H22,spisak!$B$4:$B$542,0)))","v":"Napad"},3,0,{"v":1107,"d":"11-07"},{"v":1105,"d":"11-05"},{"v":1108,"d":"11-08"},{"$nulls":4},"Marinković Vasilije"]
[22,"q1",11,null,null,{"$f":"grupe!C151","v":"Stefanović Luka"},{"$f":"IF(F23=\"bye\",\"\",INDEX(spisak!$C$4:$C$308,MATCH(F23,spisak!$B$4:$B$542,0)))","v":"Novi Sad"},{"$f":"grupe!D151","v":"bye"},{"$f":"IF(H23=\"bye\",\"\",INDEX(spisak!$C$4:$C$308,MATCH(H23,spisak!$B$4:$B$542,0)))","v":""},{"$nulls":9},""]
[23,"q1",12,null,null,{"$f":"grupe!C164","v":"Radonjić Stefan"},{"$f":"IF(F24=\"bye\",\"\",INDEX(spisak!$C$4:$C$308,MATCH(F24,spisak!$B$4:$B$542,0)))","v":"Milenijum"},{"$f":"grupe!D164","v":"Ilič Gavrilo"},{"$f":"IF(H24=\"bye\",\"\",INDEX(spisak!$C$4:$C$308,MATCH(H24,spisak!$B$4:$B$542,0)))","v":"Dubočica Leskovac"},3,0,{"v":1106,"d":"11-06"},{"v":1106,"d":"11-06"},{"v":1109,"d":"11-09"},{"$nulls":4},"Radonjić Stefan"]
[24,"q1",12,null,null,{"$f":"grupe!C165","v":"Marković Jovan"},{"$f":"IF(F25=\"bye\",\"\",INDEX(spisak!$C$4:$C$308,MATCH(F25,spisak!$B$4:$B$542,0)))","v":"Vojvodina  Novi Sad"},{"$f":"grupe!D165","v":"bye"},{"$f":"IF(H25=\"bye\",\"\",INDEX(spisak!$C$4:$C$308,MATCH(H25,spisak!$B$4:$B$542,0)))","v":""},{"$nulls":9},""]
[25,"q1",13,null,null,{"$f":"grupe!C178","v":"Miljuš Luka"},{"$f":"IF(F26=\"bye\",\"\",INDEX(spisak!$C$4:$C$308,MATCH(F26,spisak!$B$4:$B$542,0)))","v":"Vojvodina  Novi Sad"},{"$f":"grupe!D178","v":"Stojilković Aleksej"},{"$f":"IF(H26=\"bye\",\"\",INDEX(spisak!$C$4:$C$308,MATCH(H26,spisak!$B$4:$B$542,0)))","v":"Železničar Niš"},3,0,{"v":1102,"d":"11-02"},{"v":1107,"d":"11-07"},{"v":1103,"d":"11-03"},{"$nulls":4},"Miljuš Luka"]
[26,"q1",13,null,null,{"$f":"grupe!C179","v":"Pucarević Pavle"},{"$f":"IF(F27=\"bye\",\"\",INDEX(spisak!$C$4:$C$308,MATCH(F27,spisak!$B$4:$B$542,0)))","v":"Hajduk Veljko"},{"$f":"grupe!D179","v":"bye"},{"$f":"IF(H27=\"bye\",\"\",INDEX(spisak!$C$4:$C$308,MATCH(H27,spisak!$B$4:$B$542,0)))","v":""},{"$nulls":9},""]
[27,"q1",14,null,null,{"$f":"grupe!C192","v":"Gerginov Vanja"},{"$f":"IF(F28=\"bye\",\"\",INDEX(spisak!$C$4:$C$308,MATCH(F28,spisak!$B$4:$B$542,0)))","v":"Novi Sad"},{"$f":"grupe!D192","v":"Pavković Đorđe"},{"$f":"IF(H28=\"bye\",\"\",INDEX(spisak!$C$4:$C$308,MATCH(H28,spisak!$B$4:$B$542,0)))","v":"Ozren Sokobanja"},3,1,{"v":1108,"d":"11-08"},{"v":1107,"d":"11-07"},{"v":1012,"d":"10-12"},{"v":1108,"d":"11-08"},{"$nulls":3},"Gerginov Vanja"]
[28,"q1",14,null,null,{"$f":"grupe!C193","v":"Sabadoš Matej"},{"$f":"IF(F29=\"bye\",\"\",INDEX(spisak!$C$4:$C$308,MATCH(F29,spisak!$B$4:$B$542,0)))","v":"Rusin"},{"$f":"grupe!D193","v":"bye"},{"$f":"IF(H29=\"bye\",\"\",INDEX(spisak!$C$4:$C$308,MATCH(H29,spisak!$B$4:$B$542,0)))","v":""},{"$nulls":9},""]
[29,"q1",15,null,null,{"$f":"grupe!C206","v":"Rajić Dalibor"},{"$f":"IF(F30=\"bye\",\"\",INDEX(spisak!$C$4:$C$308,MATCH(F30,spisak!$B$4:$B$542,0)))","v":"Novi Sad"},{"$f":"grupe!D206","v":"Aleksandar Todorov"},{"$f":"IF(H30=\"bye\",\"\",INDEX(spisak!$C$4:$C$308,MATCH(H30,spisak!$B$4:$B$542,0)))","v":"Bdinci Bugarska"},3,0,{"v":1101,"d":"11-01"},{"v":1103,"d":"11-03"},{"v":1101,"d":"11-01"},{"$nulls":4},"Rajić Dalibor"]
[30,"q1",15,null,null,{"$f":"grupe!C207","v":"Paunović Petar"},{"$f":"IF(F31=\"bye\",\"\",INDEX(spisak!$C$4:$C$308,MATCH(F31,spisak!$B$4:$B$542,0)))","v":"Stoni"},{"$f":"grupe!D207","v":"bye"},{"$f":"IF(H31=\"bye\",\"\",INDEX(spisak!$C$4:$C$308,MATCH(H31,spisak!$B$4:$B$542,0)))","v":""},{"$nulls":9},""]
[31,"q1",16,null,null,{"$f":"grupe!C220","v":"Jozić Marino"},{"$f":"IF(F32=\"bye\",\"\",INDEX(spisak!$C$4:$C$308,MATCH(F32,spisak!$B$4:$B$542,0)))","v":"Spartak"},{"$f":"grupe!D220","v":"Vičević Luka"},{"$f":"IF(H32=\"bye\",\"\",INDEX(spisak!$C$4:$C$308,MATCH(H32,spisak!$B$4:$B$542,0)))","v":"Barajevo"},3,0,{"v":1210,"d":"12-10"},{"v":1109,"d":"11-09"},{"v":1102,"d":"11-02"},{"$nulls":4},"Jozić Marino"]
[32,"q1",16,null,null,{"$f":"grupe!C221","v":"Vasić Bogdan"},{"$f":"IF(F33=\"bye\",\"\",INDEX(spisak!$C$4:$C$308,MATCH(F33,spisak!$B$4:$B$542,0)))","v":"Stoni"},{"$f":"grupe!D221","v":"bye"},{"$f":"IF(H33=\"bye\",\"\",INDEX(spisak!$C$4:$C$308,MATCH(H33,spisak!$B$4:$B$542,0)))","v":""},{"$nulls":9},""]
[33,"q1",17,null,null,{"$f":"grupe!C234","v":0},{"$f":"IF(F34=\"bye\",\"\",INDEX(spisak!$C$4:$C$308,MATCH(F34,spisak!$B$4:$B$542,0)))","v":{"$error":"#N/A"}},{"$f":"grupe!D234","v":0},{"$f":"IF(H34=\"bye\",\"\",INDEX(spisak!$C$4:$C$308,MATCH(H34,spisak!$B$4:$B$542,0)))","v":{"$error":"#N/A"}},{"$nulls":9},{"$f":"IF(ISBLANK(J34),\"\",IF(J34>K34,F34,H34))","v":""}]
[34,"q1",17,null,null,{"$f":"grupe!C235","v":0},{"$f":"IF(F35=\"bye\",\"\",INDEX(spisak!$C$4:$C$308,MATCH(F35,spisak!$B$4:$B$542,0)))","v":{"$error":"#N/A"}},{"$f":"grupe!D235","v":0},{"$f":"IF(H35=\"bye\",\"\",INDEX(spisak!$C$4:$C$308,MATCH(H35,spisak!$B$4:$B$542,0)))","v":{"$error":"#N/A"}},{"$nulls":9},""]
[35,"q1",18,null,null,{"$f":"grupe!C248","v":0},{"$f":"IF(F36=\"bye\",\"\",INDEX(spisak!$C$4:$C$308,MATCH(F36,spisak!$B$4:$B$542,0)))","v":{"$error":"#N/A"}},{"$f":"grupe!D248","v":0},{"$f":"IF(H36=\"bye\",\"\",INDEX(spisak!$C$4:$C$308,MATCH(H36,spisak!$B$4:$B$542,0)))","v":{"$error":"#N/A"}},{"$nulls":9},""]
[36,"q1",18,null,null,{"$f":"grupe!C249","v":0},{"$f":"IF(F37=\"bye\",\"\",INDEX(spisak!$C$4:$C$308,MATCH(F37,spisak!$B$4:$B$542,0)))","v":{"$error":"#N/A"}},{"$f":"grupe!D249","v":0},{"$f":"IF(H37=\"bye\",\"\",INDEX(spisak!$C$4:$C$308,MATCH(H37,spisak!$B$4:$B$542,0)))","v":{"$error":"#N/A"}},{"$nulls":9},""]
[37,"q1",19,null,null,{"$f":"grupe!C262","v":0},{"$f":"IF(F38=\"bye\",\"\",INDEX(spisak!$C$4:$C$308,MATCH(F38,spisak!$B$4:$B$542,0)))","v":{"$error":"#N/A"}},{"$f":"grupe!D262","v":0},{"$f":"IF(H38=\"bye\",\"\",INDEX(spisak!$C$4:$C$308,MATCH(H38,spisak!$B$4:$B$542,0)))","v":{"$error":"#N/A"}},{"$nulls":9},""]
[38,"q1",19,null,null,{"$f":"grupe!C263","v":0},{"$f":"IF(F39=\"bye\",\"\",INDEX(spisak!$C$4:$C$308,MATCH(F39,spisak!$B$4:$B$542,0)))","v":{"$error":"#N/A"}},{"$f":"grupe!D263","v":0},{"$f":"IF(H39=\"bye\",\"\",INDEX(spisak!$C$4:$C$308,MATCH(H39,spisak!$B$4:$B$542,0)))","v":{"$error":"#N/A"}},{"$nulls":9},""]
[39,"q1",20,null,null,{"$f":"grupe!C276","v":0},{"$f":"IF(F40=\"bye\",\"\",INDEX(spisak!$C$4:$C$308,MATCH(F40,spisak!$B$4:$B$542,0)))","v":{"$error":"#N/A"}},{"$f":"grupe!D276","v":0},{"$f":"IF(H40=\"bye\",\"\",INDEX(spisak!$C$4:$C$308,MATCH(H40,spisak!$B$4:$B$542,0)))","v":{"$error":"#N/A"}},{"$nulls":9},""]
[40,"q1",20,null,null,{"$f":"grupe!C277","v":0},{"$f":"IF(F41=\"bye\",\"\",INDEX(spisak!$C$4:$C$308,MATCH(F41,spisak!$B$4:$B$542,0)))","v":{"$error":"#N/A"}},{"$f":"grupe!D277","v":0},{"$f":"IF(H41=\"bye\",\"\",INDEX(spisak!$C$4:$C$308,MATCH(H41,spisak!$B$4:$B$542,0)))","v":{"$error":"#N/A"}},{"$nulls":9},""]
[41,"q1",21,null,null,{"$f":"grupe!C290","v":0},{"$f":"IF(F42=\"bye\",\"\",INDEX(spisak!$C$4:$C$308,MATCH(F42,spisak!$B$4:$B$542,0)))","v":{"$error":"#N/A"}},{"$f":"grupe!D290","v":0},{"$f":"IF(H42=\"bye\",\"\",INDEX(spisak!$C$4:$C$308,MATCH(H42,spisak!$B$4:$B$542,0)))","v":{"$error":"#N/A"}},{"$nulls":9},""]
[42,"q1",21,null,null,{"$f":"grupe!C291","v":0},{"$f":"IF(F43=\"bye\",\"\",INDEX(spisak!$C$4:$C$308,MATCH(F43,spisak!$B$4:$B$542,0)))","v":{"$error":"#N/A"}},{"$f":"grupe!D291","v":0},{"$f":"IF(H43=\"bye\",\"\",INDEX(spisak!$C$4:$C$308,MATCH(H43,spisak!$B$4:$B$542,0)))","v":{"$error":"#N/A"}},{"$nulls":9},""]
[43,"q1",22,null,null,{"$f":"grupe!C304","v":0},{"$f":"IF(F44=\"bye\",\"\",INDEX(spisak!$C$4:$C$308,MATCH(F44,spisak!$B$4:$B$542,0)))","v":{"$error":"#N/A"}},{"$f":"grupe!D304","v":0},{"$f":"IF(H44=\"bye\",\"\",INDEX(spisak!$C$4:$C$308,MATCH(H44,spisak!$B$4:$B$542,0)))","v":{"$error":"#N/A"}},{"$nulls":9},""]
[44,"q1",22,null,null,{"$f":"grupe!C305","v":0},{"$f":"IF(F45=\"bye\",\"\",INDEX(spisak!$C$4:$C$308,MATCH(F45,spisak!$B$4:$B$542,0)))","v":{"$error":"#N/A"}},{"$f":"grupe!D305","v":0},{"$f":"IF(H45=\"bye\",\"\",INDEX(spisak!$C$4:$C$308,MATCH(H45,spisak!$B$4:$B$542,0)))","v":{"$error":"#N/A"}},{"$nulls":9},""]
[45,"q1",23,null,null,{"$f":"grupe!C318","v":0},{"$f":"IF(F46=\"bye\",\"\",INDEX(spisak!$C$4:$C$308,MATCH(F46,spisak!$B$4:$B$542,0)))","v":{"$error":"#N/A"}},{"$f":"grupe!D318","v":0},{"$f":"IF(H46=\"bye\",\"\",INDEX(spisak!$C$4:$C$308,MATCH(H46,spisak!$B$4:$B$542,0)))","v":{"$error":"#N/A"}},{"$nulls":9},""]
[46,"q1",23,null,null,{"$f":"grupe!C319","v":0},{"$f":"IF(F47=\"bye\",\"\",INDEX(spisak!$C$4:$C$308,MATCH(F47,spisak!$B$4:$B$542,0)))","v":{"$error":"#N/A"}},{"$f":"grupe!D319","v":0},{"$f":"IF(H47=\"bye\",\"\",INDEX(spisak!$C$4:$C$308,MATCH(H47,spisak!$B$4:$B$542,0)))","v":{"$error":"#N/A"}},{"$nulls":9},""]
[47,"q1",24,null,null,{"$f":"grupe!C332","v":0},{"$f":"IF(F48=\"bye\",\"\",INDEX(spisak!$C$4:$C$308,MATCH(F48,spisak!$B$4:$B$542,0)))","v":{"$error":"#N/A"}},{"$f":"grupe!D332","v":0},{"$f":"IF(H48=\"bye\",\"\",INDEX(spisak!$C$4:$C$308,MATCH(H48,spisak!$B$4:$B$542,0)))","v":{"$error":"#N/A"}},{"$nulls":9},""]
[48,"q1",24,null,null,{"$f":"grupe!C333","v":0},{"$f":"IF(F49=\"bye\",\"\",INDEX(spisak!$C$4:$C$308,MATCH(F49,spisak!$B$4:$B$542,0)))","v":{"$error":"#N/A"}},{"$f":"grupe!D333","v":0},{"$f":"IF(H49=\"bye\",\"\",INDEX(spisak!$C$4:$C$308,MATCH(H49,spisak!$B$4:$B$542,0)))","v":{"$error":"#N/A"}},{"$nulls":9},""]
[49,"q1",25,null,null,{"$f":"grupe!C346","v":0},{"$f":"IF(F50=\"bye\",\"\",INDEX(spisak!$C$4:$C$308,MATCH(F50,spisak!$B$4:$B$542,0)))","v":{"$error":"#N/A"}},{"$f":"grupe!D346","v":0},{"$f":"IF(H50=\"bye\",\"\",INDEX(spisak!$C$4:$C$308,MATCH(H50,spisak!$B$4:$B$542,0)))","v":{"$error":"#N/A"}},{"$nulls":9},""]
[50,"q1",25,null,null,{"$f":"grupe!C347","v":0},{"$f":"IF(F51=\"bye\",\"\",INDEX(spisak!$C$4:$C$308,MATCH(F51,spisak!$B$4:$B$542,0)))","v":{"$error":"#N/A"}},{"$f":"grupe!D347","v":0},{"$f":"IF(H51=\"bye\",\"\",INDEX(spisak!$C$4:$C$308,MATCH(H51,spisak!$B$4:$B$542,0)))","v":{"$error":"#N/A"}},{"$nulls":9},""]
[51,"q1",26,null,null,{"$f":"grupe!C360","v":0},{"$f":"IF(F52=\"bye\",\"\",INDEX(spisak!$C$4:$C$308,MATCH(F52,spisak!$B$4:$B$542,0)))","v":{"$error":"#N/A"}},{"$f":"grupe!D360","v":0},{"$f":"IF(H52=\"bye\",\"\",INDEX(spisak!$C$4:$C$308,MATCH(H52,spisak!$B$4:$B$542,0)))","v":{"$error":"#N/A"}},{"$nulls":9},""]
[52,"q1",26,null,null,{"$f":"grupe!C361","v":0},{"$f":"IF(F53=\"bye\",\"\",INDEX(spisak!$C$4:$C$308,MATCH(F53,spisak!$B$4:$B$542,0)))","v":{"$error":"#N/A"}},{"$f":"grupe!D361","v":0},{"$f":"IF(H53=\"bye\",\"\",INDEX(spisak!$C$4:$C$308,MATCH(H53,spisak!$B$4:$B$542,0)))","v":{"$error":"#N/A"}},{"$nulls":9},""]
[53,"q1",27,null,null,{"$f":"grupe!C374","v":0},{"$f":"IF(F54=\"bye\",\"\",INDEX(spisak!$C$4:$C$308,MATCH(F54,spisak!$B$4:$B$542,0)))","v":{"$error":"#N/A"}},{"$f":"grupe!D374","v":0},{"$f":"IF(H54=\"bye\",\"\",INDEX(spisak!$C$4:$C$308,MATCH(H54,spisak!$B$4:$B$542,0)))","v":{"$error":"#N/A"}},{"$nulls":9},""]
[54,"q1",27,null,null,{"$f":"grupe!C375","v":0},{"$f":"IF(F55=\"bye\",\"\",INDEX(spisak!$C$4:$C$308,MATCH(F55,spisak!$B$4:$B$542,0)))","v":{"$error":"#N/A"}},{"$f":"grupe!D375","v":0},{"$f":"IF(H55=\"bye\",\"\",INDEX(spisak!$C$4:$C$308,MATCH(H55,spisak!$B$4:$B$542,0)))","v":{"$error":"#N/A"}},{"$nulls":9},""]
[55,"q1",28,null,null,{"$f":"grupe!C388","v":0},{"$f":"IF(F56=\"bye\",\"\",INDEX(spisak!$C$4:$C$308,MATCH(F56,spisak!$B$4:$B$542,0)))","v":{"$error":"#N/A"}},{"$f":"grupe!D388","v":0},{"$f":"IF(H56=\"bye\",\"\",INDEX(spisak!$C$4:$C$308,MATCH(H56,spisak!$B$4:$B$542,0)))","v":{"$error":"#N/A"}},{"$nulls":9},""]
[56,"q1",28,null,null,{"$f":"grupe!C389","v":0},{"$f":"IF(F57=\"bye\",\"\",INDEX(spisak!$C$4:$C$308,MATCH(F57,spisak!$B$4:$B$542,0)))","v":{"$error":"#N/A"}},{"$f":"grupe!D389","v":0},{"$f":"IF(H57=\"bye\",\"\",INDEX(spisak!$C$4:$C$308,MATCH(H57,spisak!$B$4:$B$542,0)))","v":{"$error":"#N/A"}},{"$nulls":9},""]
[57,"q1",29,null,null,{"$f":"grupe!C402","v":0},{"$f":"IF(F58=\"bye\",\"\",INDEX(spisak!$C$4:$C$308,MATCH(F58,spisak!$B$4:$B$542,0)))","v":{"$error":"#N/A"}},{"$f":"grupe!D402","v":0},{"$f":"IF(H58=\"bye\",\"\",INDEX(spisak!$C$4:$C$308,MATCH(H58,spisak!$B$4:$B$542,0)))","v":{"$error":"#N/A"}},{"$nulls":9},""]
[58,"q1",29,null,null,{"$f":"grupe!C403","v":0},{"$f":"IF(F59=\"bye\",\"\",INDEX(spisak!$C$4:$C$308,MATCH(F59,spisak!$B$4:$B$542,0)))","v":{"$error":"#N/A"}},{"$f":"grupe!D403","v":0},{"$f":"IF(H59=\"bye\",\"\",INDEX(spisak!$C$4:$C$308,MATCH(H59,spisak!$B$4:$B$542,0)))","v":{"$error":"#N/A"}},{"$nulls":9},""]
[59,"q1",30,null,null,{"$f":"grupe!C416","v":0},{"$f":"IF(F60=\"bye\",\"\",INDEX(spisak!$C$4:$C$308,MATCH(F60,spisak!$B$4:$B$542,0)))","v":{"$error":"#N/A"}},{"$f":"grupe!D416","v":0},{"$f":"IF(H60=\"bye\",\"\",INDEX(spisak!$C$4:$C$308,MATCH(H60,spisak!$B$4:$B$542,0)))","v":{"$error":"#N/A"}},{"$nulls":9},""]
[60,"q1",30,null,null,{"$f":"grupe!C417","v":0},{"$f":"IF(F61=\"bye\",\"\",INDEX(spisak!$C$4:$C$308,MATCH(F61,spisak!$B$4:$B$542,0)))","v":{"$error":"#N/A"}},{"$f":"grupe!D417","v":0},{"$f":"IF(H61=\"bye\",\"\",INDEX(spisak!$C$4:$C$308,MATCH(H61,spisak!$B$4:$B$542,0)))","v":{"$error":"#N/A"}},{"$nulls":9},""]
[61,"q1",31,null,null,{"$f":"grupe!C430","v":0},{"$f":"IF(F62=\"bye\",\"\",INDEX(spisak!$C$4:$C$308,MATCH(F62,spisak!$B$4:$B$542,0)))","v":{"$error":"#N/A"}},{"$f":"grupe!D430","v":0},{"$f":"IF(H62=\"bye\",\"\",INDEX(spisak!$C$4:$C$308,MATCH(H62,spisak!$B$4:$B$542,0)))","v":{"$error":"#N/A"}},{"$nulls":9},""]
[62,"q1",31,null,null,{"$f":"grupe!C431","v":0},{"$f":"IF(F63=\"bye\",\"\",INDEX(spisak!$C$4:$C$308,MATCH(F63,spisak!$B$4:$B$542,0)))","v":{"$error":"#N/A"}},{"$f":"grupe!D431","v":0},{"$f":"IF(H63=\"bye\",\"\",INDEX(spisak!$C$4:$C$308,MATCH(H63,spisak!$B$4:$B$542,0)))","v":{"$error":"#N/A"}},{"$nulls":9},""]
[63,"q1",32,null,null,{"$f":"grupe!C444","v":0},{"$f":"IF(F64=\"bye\",\"\",INDEX(spisak!$C$4:$C$308,MATCH(F64,spisak!$B$4:$B$542,0)))","v":{"$error":"#N/A"}},{"$f":"grupe!D444","v":0},{"$f":"IF(H64=\"bye\",\"\",INDEX(spisak!$C$4:$C$308,MATCH(H64,spisak!$B$4:$B$542,0)))","v":{"$error":"#N/A"}},{"$nulls":9},""]
[64,"q1",32,null,null,{"$f":"grupe!C445","v":0},{"$f":"IF(F65=\"bye\",\"\",INDEX(spisak!$C$4:$C$308,MATCH(F65,spisak!$B$4:$B$542,0)))","v":{"$error":"#N/A"}},{"$f":"grupe!D445","v":0},{"$f":"IF(H65=\"bye\",\"\",INDEX(spisak!$C$4:$C$308,MATCH(H65,spisak!$B$4:$B$542,0)))","v":{"$error":"#N/A"}},{"$nulls":9},""]
[65,"q1",33,null,null,{"$f":"grupe!C458","v":0},{"$f":"IF(F66=\"bye\",\"\",INDEX(spisak!$C$4:$C$308,MATCH(F66,spisak!$B$4:$B$542,0)))","v":{"$error":"#N/A"}},{"$f":"grupe!D458","v":0},{"$f":"IF(H66=\"bye\",\"\",INDEX(spisak!$C$4:$C$308,MATCH(H66,spisak!$B$4:$B$542,0)))","v":{"$error":"#N/A"}},{"$nulls":9},{"$f":"IF(ISBLANK(J66),\"\",IF(J66>K66,F66,H66))","v":""}]
[66,"q1",33,null,null,{"$f":"grupe!C459","v":0},{"$f":"IF(F67=\"bye\",\"\",INDEX(spisak!$C$4:$C$308,MATCH(F67,spisak!$B$4:$B$542,0)))","v":{"$error":"#N/A"}},{"$f":"grupe!D459","v":0},{"$f":"IF(H67=\"bye\",\"\",INDEX(spisak!$C$4:$C$308,MATCH(H67,spisak!$B$4:$B$542,0)))","v":{"$error":"#N/A"}},{"$nulls":9},""]
[67,"q2",1,null,null,{"$f":"grupe!C12","v":"Ilić Bogdan"},{"$f":"IF(F68=\"bye\",\"\",INDEX(spisak!$C$4:$C$308,MATCH(F68,spisak!$B$4:$B$542,0)))","v":"Napad"},{"$f":"grupe!D12","v":"Ivančev Đorđe"},{"$f":"IF(H68=\"bye\",\"\",INDEX(spisak!$C$4:$C$308,MATCH(H68,spisak!$B$4:$B$542,0)))","v":"Sinđelić Beograd"},3,0,{"v":1104,"d":"11-04"},{"v":1106,"d":"11-06"},{"v":1107,"d":"11-07"},{"$nulls":4},"Ilić Bogdan"]
[68,"q2",1,null,null,{"$f":"grupe!C13","v":"Zaharijev  Nikola"},{"$f":"IF(F69=\"bye\",\"\",INDEX(spisak!$C$4:$C$308,MATCH(F69,spisak!$B$4:$B$542,0)))","v":"Mladost Bosilegrad"},{"$f":"grupe!D13","v":"bye"},{"$f":"IF(H69=\"bye\",\"\",INDEX(spisak!$C$4:$C$308,MATCH(H69,spisak!$B$4:$B$542,0)))","v":""},{"$nulls":9},""]
[69,"q2",2,null,null,{"$f":"grupe!C26","v":"Šepa Matija"},{"$f":"IF(F70=\"bye\",\"\",INDEX(spisak!$C$4:$C$308,MATCH(F70,spisak!$B$4:$B$542,0)))","v":"Stak Zemun"},{"$f":"grupe!D26","v":"Putnik Dario"},{"$f":"IF(H70=\"bye\",\"\",INDEX(spisak!$C$4:$C$308,MATCH(H70,spisak!$B$4:$B$542,0)))","v":"Milenijum"},3,0,{"v":1104,"d":"11-04"},{"v":1106,"d":"11-06"},{"v":1105,"d":"11-05"},{"$nulls":4},"Šepa Matija"]
[70,"q2",2,null,null,{"$f":"grupe!C27","v":"Jović Aleksandar"},{"$f":"IF(F71=\"bye\",\"\",INDEX(spisak!$C$4:$C$308,MATCH(F71,spisak!$B$4:$B$542,0)))","v":"Dubočica Leskovac"},{"$f":"grupe!D27","v":"bye"},{"$f":"IF(H71=\"bye\",\"\",INDEX(spisak!$C$4:$C$308,MATCH(H71,spisak!$B$4:$B$542,0)))","v":""},{"$nulls":9},""]
[71,"q2",3,null,null,{"$f":"grupe!C40","v":"Stefanović Vanja"},{"$f":"IF(F72=\"bye\",\"\",INDEX(spisak!$C$4:$C$308,MATCH(F72,spisak!$B$4:$B$542,0)))","v":"Stak Zemun"},{"$f":"grupe!D40","v":"Kalinić Ilija"},{"$f":"IF(H72=\"bye\",\"\",INDEX(spisak!$C$4:$C$308,MATCH(H72,spisak!$B$4:$B$542,0)))","v":"Ugrinovci"},"w",0,{"$nulls":7},"Stefanović Vanja"]
[72,"q2",3,null,null,{"$f":"grupe!C41","v":"Velinović Miloš"},{"$f":"IF(F73=\"bye\",\"\",INDEX(spisak!$C$4:$C$308,MATCH(F73,spisak!$B$4:$B$542,0)))","v":"Belo Polje"},{"$f":"grupe!D41","v":"bye"},{"$f":"IF(H73=\"bye\",\"\",INDEX(spisak!$C$4:$C$308,MATCH(H73,spisak!$B$4:$B$542,0)))","v":""},{"$nulls":9},""]
[73,"q2",4,null,null,{"$f":"grupe!C54","v":"Pavlović Dušan"},{"$f":"IF(F74=\"bye\",\"\",INDEX(spisak!$C$4:$C$308,MATCH(F74,spisak!$B$4:$B$542,0)))","v":"Stak Zemun"},{"$f":"grupe!D54","v":"Miovčić Mihailo"},{"$f":"IF(H74=\"bye\",\"\",INDEX(spisak!$C$4:$C$308,MATCH(H74,spisak!$B$4:$B$542,0)))","v":"Sinđelić Beograd"},3,0,{"v":1102,"d":"11-02"},{"v":1103,"d":"11-03"},{"v":1104,"d":"11-04"},{"$nulls":4},"Pavlović Dušan"]
[74,"q2",4,null,null,{"$f":"grupe!C55","v":"Dragin Luka"},{"$f":"IF(F75=\"bye\",\"\",INDEX(spisak!$C$4:$C$308,MATCH(F75,spisak!$B$4:$B$542,0)))","v":"Borac Čačak"},{"$f":"grupe!D55","v":"bye"},{"$f":"IF(H75=\"bye\",\"\",INDEX(spisak!$C$4:$C$308,MATCH(H75,spisak!$B$4:$B$542,0)))","v":""},{"$nulls":9},""]
[75,"q2",5,null,null,{"$f":"grupe!C68","v":"Jelikić Dimitrije"},{"$f":"IF(F76=\"bye\",\"\",INDEX(spisak!$C$4:$C$308,MATCH(F76,spisak!$B$4:$B$542,0)))","v":"Crvena Zvezda Beograd"},{"$f":"grupe!D68","v":"Kalinčević Vladimir"},{"$f":"IF(H76=\"bye\",\"\",INDEX(spisak!$C$4:$C$308,MATCH(H76,spisak!$B$4:$B$542,0)))","v":"Sinđelić Beograd"},3,0,{"v":1106,"d":"11-06"},{"v":1103,"d":"11-03"},{"v":1108,"d":"11-08"},{"$nulls":4},"Jelikić Dimitrije"]
[76,"q2",5,null,null,{"$f":"grupe!C69","v":"Janićijević Ognjen"},{"$f":"IF(F77=\"bye\",\"\",INDEX(spisak!$C$4:$C$308,MATCH(F77,spisak!$B$4:$B$542,0)))","v":"Lala"},{"$f":"grupe!D69","v":"bye"},{"$f":"IF(H77=\"bye\",\"\",INDEX(spisak!$C$4:$C$308,MATCH(H77,spisak!$B$4:$B$542,0)))","v":""},{"$nulls":9},""]
[77,"q2",6,null,null,{"$f":"grupe!C82","v":"Varga Danijel"},{"$f":"IF(F78=\"bye\",\"\",INDEX(spisak!$C$4:$C$308,MATCH(F78,spisak!$B$4:$B$542,0)))","v":"Temerin"},{"$f":"grupe!D82","v":"Marton Filip"},{"$f":"IF(H78=\"bye\",\"\",INDEX(spisak!$C$4:$C$308,MATCH(H78,spisak!$B$4:$B$542,0)))","v":"Doža"},3,0,{"v":1108,"d":"11-08"},{"v":1105,"d":"11-05"},{"v":1105,"d":"11-05"},{"$nulls":4},"Varga Danijel"]
[78,"q2",6,null,null,{"$f":"grupe!C83","v":"Preslav Nikolov"},{"$f":"IF(F79=\"bye\",\"\",INDEX(spisak!$C$4:$C$308,MATCH(F79,spisak!$B$4:$B$542,0)))","v":"Bdinci Bugarska"},{"$f":"grupe!D83","v":"bye"},{"$f":"IF(H79=\"bye\",\"\",INDEX(spisak!$C$4:$C$308,MATCH(H79,spisak!$B$4:$B$542,0)))","v":""},{"$nulls":9},""]
[79,"q2",7,null,null,{"$f":"grupe!C96","v":"Pavlović Dimitrije"},{"$f":"IF(F80=\"bye\",\"\",INDEX(spisak!$C$4:$C$308,MATCH(F80,spisak!$B$4:$B$542,0)))","v":"Stak Zemun"},{"$f":"grupe!D96","v":"Dragin Saša"},{"$f":"IF(H80=\"bye\",\"\",INDEX(spisak!$C$4:$C$308,MATCH(H80,spisak!$B$4:$B$542,0)))","v":"Borac Čačak"},3,0,{"v":1104,"d":"11-04"},{"v":1106,"d":"11-06"},{"v":1101,"d":"11-01"},{"$nulls":4},"Pavlović Dimitrije"]
[80,"q2",7,null,null,{"$f":"grupe!C97","v":"Živadinović Dimitrije"},{"$f":"IF(F81=\"bye\",\"\",INDEX(spisak!$C$4:$C$308,MATCH(F81,spisak!$B$4:$B$542,0)))","v":"Železničar Niš"},{"$f":"grupe!D97","v":"bye"},{"$f":"IF(H81=\"bye\",\"\",INDEX(spisak!$C$4:$C$308,MATCH(H81,spisak!$B$4:$B$542,0)))","v":""},{"$nulls":9},""]
[81,"q2",8,null,null,{"$f":"grupe!C110","v":"Bošković Marko"},{"$f":"IF(F82=\"bye\",\"\",INDEX(spisak!$C$4:$C$308,MATCH(F82,spisak!$B$4:$B$542,0)))","v":"Stak Zemun"},{"$f":"grupe!D110","v":"Mladenović Ognjen"},{"$f":"IF(H82=\"bye\",\"\",INDEX(spisak!$C$4:$C$308,MATCH(H82,spisak!$B$4:$B$542,0)))","v":"Prva Petoletka"},3,1,{"v":1108,"d":"11-08"},{"v":1102,"d":"11-02"},{"v":711,"d":"07-11"},{"v":1105,"d":"11-05"},{"$nulls":3},"Bošković Marko"]
[82,"q2",8,null,null,{"$f":"grupe!C111","v":"Titovski Nenad"},{"$f":"IF(F83=\"bye\",\"\",INDEX(spisak!$C$4:$C$308,MATCH(F83,spisak!$B$4:$B$542,0)))","v":"Skoplje"},{"$f":"grupe!D111","v":"bye"},{"$f":"IF(H83=\"bye\",\"\",INDEX(spisak!$C$4:$C$308,MATCH(H83,spisak!$B$4:$B$542,0)))","v":""},{"$nulls":9},""]
[83,"q2",9,null,null,{"$f":"grupe!C124","v":"Ninković Uroš"},{"$f":"IF(F84=\"bye\",\"\",INDEX(spisak!$C$4:$C$308,MATCH(F84,spisak!$B$4:$B$542,0)))","v":"Stak Zemun"},{"$f":"grupe!D124","v":"Jovanović Đurađ"},{"$f":"IF(H84=\"bye\",\"\",INDEX(spisak!$C$4:$C$308,MATCH(H84,spisak!$B$4:$B$542,0)))","v":"Sinđelić Beograd"},3,0,{"v":1109,"d":"11-09"},{"v":1104,"d":"11-04"},{"v":1107,"d":"11-07"},{"$nulls":4},"Ninković Uroš"]
[84,"q2",9,null,null,{"$f":"grupe!C125","v":"Lazić Nemanja"},{"$f":"IF(F85=\"bye\",\"\",INDEX(spisak!$C$4:$C$308,MATCH(F85,spisak!$B$4:$B$542,0)))","v":"Lala"},{"$f":"grupe!D125","v":"bye"},{"$f":"IF(H85=\"bye\",\"\",INDEX(spisak!$C$4:$C$308,MATCH(H85,spisak!$B$4:$B$542,0)))","v":""},{"$nulls":9},""]
[85,"q2",10,null,null,{"$f":"grupe!C138","v":"Rajić Borislav"},{"$f":"IF(F86=\"bye\",\"\",INDEX(spisak!$C$4:$C$308,MATCH(F86,spisak!$B$4:$B$542,0)))","v":"Novi Sad"},{"$f":"grupe!D138","v":"Konstantinov Marko"},{"$f":"IF(H86=\"bye\",\"\",INDEX(spisak!$C$4:$C$308,MATCH(H86,spisak!$B$4:$B$542,0)))","v":"Vršac"},3,1,{"v":811,"d":"08-11"},{"v":1109,"d":"11-09"},{"v":1108,"d":"11-08"},{"v":1109,"d":"11-09"},{"$nulls":3},"Rajić Borislav"]
[86,"q2",10,null,null,{"$f":"grupe!C139","v":"Ivailo Bojanov"},{"$f":"IF(F87=\"bye\",\"\",INDEX(spisak!$C$4:$C$308,MATCH(F87,spisak!$B$4:$B$542,0)))","v":"Bdinci Bugarska"},{"$f":"grupe!D139","v":"bye"},{"$f":"IF(H87=\"bye\",\"\",INDEX(spisak!$C$4:$C$308,MATCH(H87,spisak!$B$4:$B$542,0)))","v":""},{"$nulls":9},""]
[87,"q2",11,null,null,{"$f":"grupe!C152","v":"Marinković Vasilije"},{"$f":"IF(F88=\"bye\",\"\",INDEX(spisak!$C$4:$C$308,MATCH(F88,spisak!$B$4:$B$542,0)))","v":"Barajevo"},{"$f":"grupe!D152","v":"Stefanović Luka"},{"$f":"IF(H88=\"bye\",\"\",INDEX(spisak!$C$4:$C$308,MATCH(H88,spisak!$B$4:$B$542,0)))","v":"Novi Sad"},3,0,{"v":1105,"d":"11-05"},{"v":1108,"d":"11-08"},{"v":1107,"d":"11-07"},{"$nulls":4},"Marinković Vasilije"]
[88,"q2",11,null,null,{"$f":"grupe!C153","v":"Orolić Đorđe"},{"$f":"IF(F89=\"bye\",\"\",INDEX(spisak!$C$4:$C$308,MATCH(F89,spisak!$B$4:$B$542,0)))","v":"Napad"},{"$f":"grupe!D153","v":"bye"},{"$f":"IF(H89=\"bye\",\"\",INDEX(spisak!$C$4:$C$308,MATCH(H89,spisak!$B$4:$B$542,0)))","v":""},{"$nulls":9},""]
[89,"q2",12,null,null,{"$f":"grupe!C166","v":"Radonjić Stefan"},{"$f":"IF(F90=\"bye\",\"\",INDEX(spisak!$C$4:$C$308,MATCH(F90,spisak!$B$4:$B$542,0)))","v":"Milenijum"},{"$f":"grupe!D166","v":"Marković Jovan"},{"$f":"IF(H90=\"bye\",\"\",INDEX(spisak!$C$4:$C$308,MATCH(H90,spisak!$B$4:$B$542,0)))","v":"Vojvodina  Novi Sad"},3,0,{"v":1105,"d":"11-05"},{"v":1104,"d":"11-04"},{"v":1109,"d":"11-09"},{"$nulls":4},"Radonjić Stefan"]
[90,"q2",12,null,null,{"$f":"grupe!C167","v":"Ilič Gavrilo"},{"$f":"IF(F91=\"bye\",\"\",INDEX(spisak!$C$4:$C$308,MATCH(F91,spisak!$B$4:$B$542,0)))","v":"Dubočica Leskovac"},{"$f":"grupe!D167","v":"bye"},{"$f":"IF(H91=\"bye\",\"\",INDEX(spisak!$C$4:$C$308,MATCH(H91,spisak!$B$4:$B$542,0)))","v":""},{"$nulls":9},""]
[91,"q2",13,null,null,{"$f":"grupe!C180","v":"Miljuš Luka"},{"$f":"IF(F92=\"bye\",\"\",INDEX(spisak!$C$4:$C$308,MATCH(F92,spisak!$B$4:$B$542,0)))","v":"Vojvodina  Novi Sad"},{"$f":"grupe!D180","v":"Pucarević Pavle"},{"$f":"IF(H92=\"bye\",\"\",INDEX(spisak!$C$4:$C$308,MATCH(H92,spisak!$B$4:$B$542,0)))","v":"Hajduk Veljko"},3,1,{"v":1105,"d":"11-05"},{"v":611,"d":"06-11"},{"v":1109,"d":"11-09"},{"v":1109,"d":"11-09"},{"$nulls":3},"Miljuš Luka"]
[92,"q2",13,null,null,{"$f":"grupe!C181","v":"Stojilković Aleksej"},{"$f":"IF(F93=\"bye\",\"\",INDEX(spisak!$C$4:$C$308,MATCH(F93,spisak!$B$4:$B$542,0)))","v":"Železničar Niš"},{"$f":"grupe!D181","v":"bye"},{"$f":"IF(H93=\"bye\",\"\",INDEX(spisak!$C$4:$C$308,MATCH(H93,spisak!$B$4:$B$542,0)))","v":""},{"$nulls":9},""]
[93,"q2",14,null,null,{"$f":"grupe!C194","v":"Gerginov Vanja"},{"$f":"IF(F94=\"bye\",\"\",INDEX(spisak!$C$4:$C$308,MATCH(F94,spisak!$B$4:$B$542,0)))","v":"Novi Sad"},{"$f":"grupe!D194","v":"Sabadoš Matej"},{"$f":"IF(H94=\"bye\",\"\",INDEX(spisak!$C$4:$C$308,MATCH(H94,spisak!$B$4:$B$542,0)))","v":"Rusin"},3,0,{"v":1412,"d":"14-12"},{"v":1109,"d":"11-09"},{"v":1109,"d":"11-09"},{"$nulls":4},"Gerginov Vanja"]
[94,"q2",14,null,null,{"$f":"grupe!C195","v":"Pavković Đorđe"},{"$f":"IF(F95=\"bye\",\"\",INDEX(spisak!$C$4:$C$308,MATCH(F95,spisak!$B$4:$B$542,0)))","v":"Ozren Sokobanja"},{"$f":"grupe!D195","v":"bye"},{"$f":"IF(H95=\"bye\",\"\",INDEX(spisak!$C$4:$C$308,MATCH(H95,spisak!$B$4:$B$542,0)))","v":""},{"$nulls":9},""]
[95,"q2",15,null,null,{"$f":"grupe!C208","v":"Rajić Dalibor"},{"$f":"IF(F96=\"bye\",\"\",INDEX(spisak!$C$4:$C$308,MATCH(F96,spisak!$B$4:$B$542,0)))","v":"Novi Sad"},{"$f":"grupe!D208","v":"Paunović Petar"},{"$f":"IF(H96=\"bye\",\"\",INDEX(spisak!$C$4:$C$308,MATCH(H96,spisak!$B$4:$B$542,0)))","v":"Stoni"},0,3,{"v":911,"d":"09-11"},{"v":911,"d":"09-11"},{"v":1012,"d":"10-12"},{"$nulls":4},"Paunović Petar"]
[96,"q2",15,null,null,{"$f":"grupe!C209","v":"Aleksandar Todorov"},{"$f":"IF(F97=\"bye\",\"\",INDEX(spisak!$C$4:$C$308,MATCH(F97,spisak!$B$4:$B$542,0)))","v":"Bdinci Bugarska"},{"$f":"grupe!D209","v":"bye"},{"$f":"IF(H97=\"bye\",\"\",INDEX(spisak!$C$4:$C$308,MATCH(H97,spisak!$B$4:$B$542,0)))","v":""},{"$nulls":9},""]
[97,"q2",16,null,null,{"$f":"grupe!C222","v":"Jozić Marino"},{"$f":"IF(F98=\"bye\",\"\",INDEX(spisak!$C$4:$C$308,MATCH(F98,spisak!$B$4:$B$542,0)))","v":"Spartak"},{"$f":"grupe!D222","v":"Vasić Bogdan"},{"$f":"IF(H98=\"bye\",\"\",INDEX(spisak!$C$4:$C$308,MATCH(H98,spisak!$B$4:$B$542,0)))","v":"Stoni"},3,0,{"v":1104,"d":"11-04"},{"v":1105,"d":"11-05"},{"v":1104,"d":"11-04"},{"$nulls":4},{"$f":"IF(ISBLANK(J98),\"\",IF(J98>K98,F98,H98))","v":"Jozić Marino"}]
[98,"q2",16,null,null,{"$f":"grupe!C223","v":"Vičević Luka"},{"$f":"IF(F99=\"bye\",\"\",INDEX(spisak!$C$4:$C$308,MATCH(F99,spisak!$B$4:$B$542,0)))","v":"Barajevo"},{"$f":"grupe!D223","v":"bye"},{"$f":"IF(H99=\"bye\",\"\",INDEX(spisak!$C$4:$C$308,MATCH(H99,spisak!$B$4:$B$542,0)))","v":""},{"$nulls":9},""]
[99,"q2",17,null,null,{"$f":"grupe!C236","v":0},{"$f":"IF(F100=\"bye\",\"\",INDEX(spisak!$C$4:$C$308,MATCH(F100,spisak!$B$4:$B$542,0)))","v":{"$error":"#N/A"}},{"$f":"grupe!D236","v":0},{"$f":"IF(H100=\"bye\",\"\",INDEX(spisak!$C$4:$C$308,MATCH(H100,spisak!$B$4:$B$542,0)))","v":{"$error":"#N/A"}},{"$nulls":9},""]
[100,"q2",17,null,null,{"$f":"grupe!C237","v":0},{"$f":"IF(F101=\"bye\",\"\",INDEX(spisak!$C$4:$C$308,MATCH(F101,spisak!$B$4:$B$542,0)))","v":{"$error":"#N/A"}},{"$f":"grupe!D237","v":0},{"$f":"IF(H101=\"bye\",\"\",INDEX(spisak!$C$4:$C$308,MATCH(H101,spisak!$B$4:$B$542,0)))","v":{"$error":"#N/A"}},{"$nulls":9},""]
[101,"q2",18,null,null,{"$f":"grupe!C250","v":0},{"$f":"IF(F102=\"bye\",\"\",INDEX(spisak!$C$4:$C$308,MATCH(F102,spisak!$B$4:$B$542,0)))","v":{"$error":"#N/A"}},{"$f":"grupe!D250","v":0},{"$f":"IF(H102=\"bye\",\"\",INDEX(spisak!$C$4:$C$308,MATCH(H102,spisak!$B$4:$B$542,0)))","v":{"$error":"#N/A"}},{"$nulls":9},""]
[102,"q2",18,null,null,{"$f":"grupe!C251","v":0},{"$f":"IF(F103=\"bye\",\"\",INDEX(spisak!$C$4:$C$308,MATCH(F103,spisak!$B$4:$B$542,0)))","v":{"$error":"#N/A"}},{"$f":"grupe!D251","v":0},{"$f":"IF(H103=\"bye\",\"\",INDEX(spisak!$C$4:$C$308,MATCH(H103,spisak!$B$4:$B$542,0)))","v":{"$error":"#N/A"}},{"$nulls":9},""]
[103,"q2",19,null,null,{"$f":"grupe!C264","v":0},{"$f":"IF(F104=\"bye\",\"\",INDEX(spisak!$C$4:$C$308,MATCH(F104,spisak!$B$4:$B$542,0)))","v":{"$error":"#N/A"}},{"$f":"grupe!D264","v":0},{"$f":"IF(H104=\"bye\",\"\",INDEX(spisak!$C$4:$C$308,MATCH(H104,spisak!$B$4:$B$542,0)))","v":{"$error":"#N/A"}},{"$nulls":9},""]
[104,"q2",19,null,null,{"$f":"grupe!C265","v":0},{"$f":"IF(F105=\"bye\",\"\",INDEX(spisak!$C$4:$C$308,MATCH(F105,spisak!$B$4:$B$542,0)))","v":{"$error":"#N/A"}},{"$f":"grupe!D265","v":0},{"$f":"IF(H105=\"bye\",\"\",INDEX(spisak!$C$4:$C$308,MATCH(H105,spisak!$B$4:$B$542,0)))","v":{"$error":"#N/A"}},{"$nulls":9},""]
[105,"q2",20,null,null,{"$f":"grupe!C278","v":0},{"$f":"IF(F106=\"bye\",\"\",INDEX(spisak!$C$4:$C$308,MATCH(F106,spisak!$B$4:$B$542,0)))","v":{"$error":"#N/A"}},{"$f":"grupe!D278","v":0},{"$f":"IF(H106=\"bye\",\"\",INDEX(spisak!$C$4:$C$308,MATCH(H106,spisak!$B$4:$B$542,0)))","v":{"$error":"#N/A"}},{"$nulls":9},""]
[106,"q2",20,null,null,{"$f":"grupe!C279","v":0},{"$f":"IF(F107=\"bye\",\"\",INDEX(spisak!$C$4:$C$308,MATCH(F107,spisak!$B$4:$B$542,0)))","v":{"$error":"#N/A"}},{"$f":"grupe!D279","v":0},{"$f":"IF(H107=\"bye\",\"\",INDEX(spisak!$C$4:$C$308,MATCH(H107,spisak!$B$4:$B$542,0)))","v":{"$error":"#N/A"}},{"$nulls":9},""]
[107,"q2",21,null,null,{"$f":"grupe!C292","v":0},{"$f":"IF(F108=\"bye\",\"\",INDEX(spisak!$C$4:$C$308,MATCH(F108,spisak!$B$4:$B$542,0)))","v":{"$error":"#N/A"}},{"$f":"grupe!D292","v":0},{"$f":"IF(H108=\"bye\",\"\",INDEX(spisak!$C$4:$C$308,MATCH(H108,spisak!$B$4:$B$542,0)))","v":{"$error":"#N/A"}},{"$nulls":9},""]
[108,"q2",21,null,null,{"$f":"grupe!C293","v":0},{"$f":"IF(F109=\"bye\",\"\",INDEX(spisak!$C$4:$C$308,MATCH(F109,spisak!$B$4:$B$542,0)))","v":{"$error":"#N/A"}},{"$f":"grupe!D293","v":0},{"$f":"IF(H109=\"bye\",\"\",INDEX(spisak!$C$4:$C$308,MATCH(H109,spisak!$B$4:$B$542,0)))","v":{"$error":"#N/A"}},{"$nulls":9},""]
[109,"q2",22,null,null,{"$f":"grupe!C306","v":0},{"$f":"IF(F110=\"bye\",\"\",INDEX(spisak!$C$4:$C$308,MATCH(F110,spisak!$B$4:$B$542,0)))","v":{"$error":"#N/A"}},{"$f":"grupe!D306","v":0},{"$f":"IF(H110=\"bye\",\"\",INDEX(spisak!$C$4:$C$308,MATCH(H110,spisak!$B$4:$B$542,0)))","v":{"$error":"#N/A"}},{"$nulls":9},""]
[110,"q2",22,null,null,{"$f":"grupe!C307","v":0},{"$f":"IF(F111=\"bye\",\"\",INDEX(spisak!$C$4:$C$308,MATCH(F111,spisak!$B$4:$B$542,0)))","v":{"$error":"#N/A"}},{"$f":"grupe!D307","v":0},{"$f":"IF(H111=\"bye\",\"\",INDEX(spisak!$C$4:$C$308,MATCH(H111,spisak!$B$4:$B$542,0)))","v":{"$error":"#N/A"}},{"$nulls":9},""]
[111,"q2",23,null,null,{"$f":"grupe!C320","v":0},{"$f":"IF(F112=\"bye\",\"\",INDEX(spisak!$C$4:$C$308,MATCH(F112,spisak!$B$4:$B$542,0)))","v":{"$error":"#N/A"}},{"$f":"grupe!D320","v":0},{"$f":"IF(H112=\"bye\",\"\",INDEX(spisak!$C$4:$C$308,MATCH(H112,spisak!$B$4:$B$542,0)))","v":{"$error":"#N/A"}},{"$nulls":9},""]
[112,"q2",23,null,null,{"$f":"grupe!C321","v":0},{"$f":"IF(F113=\"bye\",\"\",INDEX(spisak!$C$4:$C$308,MATCH(F113,spisak!$B$4:$B$542,0)))","v":{"$error":"#N/A"}},{"$f":"grupe!D321","v":0},{"$f":"IF(H113=\"bye\",\"\",INDEX(spisak!$C$4:$C$308,MATCH(H113,spisak!$B$4:$B$542,0)))","v":{"$error":"#N/A"}},{"$nulls":9},""]
[113,"q2",24,null,null,{"$f":"grupe!C334","v":0},{"$f":"IF(F114=\"bye\",\"\",INDEX(spisak!$C$4:$C$308,MATCH(F114,spisak!$B$4:$B$542,0)))","v":{"$error":"#N/A"}},{"$f":"grupe!D334","v":0},{"$f":"IF(H114=\"bye\",\"\",INDEX(spisak!$C$4:$C$308,MATCH(H114,spisak!$B$4:$B$542,0)))","v":{"$error":"#N/A"}},{"$nulls":9},""]
[114,"q2",24,null,null,{"$f":"grupe!C335","v":0},{"$f":"IF(F115=\"bye\",\"\",INDEX(spisak!$C$4:$C$308,MATCH(F115,spisak!$B$4:$B$542,0)))","v":{"$error":"#N/A"}},{"$f":"grupe!D335","v":0},{"$f":"IF(H115=\"bye\",\"\",INDEX(spisak!$C$4:$C$308,MATCH(H115,spisak!$B$4:$B$542,0)))","v":{"$error":"#N/A"}},{"$nulls":9},""]
[115,"q2",25,null,null,{"$f":"grupe!C348","v":0},{"$f":"IF(F116=\"bye\",\"\",INDEX(spisak!$C$4:$C$308,MATCH(F116,spisak!$B$4:$B$542,0)))","v":{"$error":"#N/A"}},{"$f":"grupe!D348","v":0},{"$f":"IF(H116=\"bye\",\"\",INDEX(spisak!$C$4:$C$308,MATCH(H116,spisak!$B$4:$B$542,0)))","v":{"$error":"#N/A"}},{"$nulls":9},""]
[116,"q2",25,null,null,{"$f":"grupe!C349","v":0},{"$f":"IF(F117=\"bye\",\"\",INDEX(spisak!$C$4:$C$308,MATCH(F117,spisak!$B$4:$B$542,0)))","v":{"$error":"#N/A"}},{"$f":"grupe!D349","v":0},{"$f":"IF(H117=\"bye\",\"\",INDEX(spisak!$C$4:$C$308,MATCH(H117,spisak!$B$4:$B$542,0)))","v":{"$error":"#N/A"}},{"$nulls":9},""]
[117,"q2",26,null,null,{"$f":"grupe!C362","v":0},{"$f":"IF(F118=\"bye\",\"\",INDEX(spisak!$C$4:$C$308,MATCH(F118,spisak!$B$4:$B$542,0)))","v":{"$error":"#N/A"}},{"$f":"grupe!D362","v":0},{"$f":"IF(H118=\"bye\",\"\",INDEX(spisak!$C$4:$C$308,MATCH(H118,spisak!$B$4:$B$542,0)))","v":{"$error":"#N/A"}},{"$nulls":9},""]
[118,"q2",26,null,null,{"$f":"grupe!C363","v":0},{"$f":"IF(F119=\"bye\",\"\",INDEX(spisak!$C$4:$C$308,MATCH(F119,spisak!$B$4:$B$542,0)))","v":{"$error":"#N/A"}},{"$f":"grupe!D363","v":0},{"$f":"IF(H119=\"bye\",\"\",INDEX(spisak!$C$4:$C$308,MATCH(H119,spisak!$B$4:$B$542,0)))","v":{"$error":"#N/A"}},{"$nulls":9},""]
[119,"q2",27,null,null,{"$f":"grupe!C376","v":0},{"$f":"IF(F120=\"bye\",\"\",INDEX(spisak!$C$4:$C$308,MATCH(F120,spisak!$B$4:$B$542,0)))","v":{"$error":"#N/A"}},{"$f":"grupe!D376","v":0},{"$f":"IF(H120=\"bye\",\"\",INDEX(spisak!$C$4:$C$308,MATCH(H120,spisak!$B$4:$B$542,0)))","v":{"$error":"#N/A"}},{"$nulls":9},""]
[120,"q2",27,null,null,{"$f":"grupe!C377","v":0},{"$f":"IF(F121=\"bye\",\"\",INDEX(spisak!$C$4:$C$308,MATCH(F121,spisak!$B$4:$B$542,0)))","v":{"$error":"#N/A"}},{"$f":"grupe!D377","v":0},{"$f":"IF(H121=\"bye\",\"\",INDEX(spisak!$C$4:$C$308,MATCH(H121,spisak!$B$4:$B$542,0)))","v":{"$error":"#N/A"}},{"$nulls":9},""]
[121,"q2",28,null,null,{"$f":"grupe!C390","v":0},{"$f":"IF(F122=\"bye\",\"\",INDEX(spisak!$C$4:$C$308,MATCH(F122,spisak!$B$4:$B$542,0)))","v":{"$error":"#N/A"}},{"$f":"grupe!D390","v":0},{"$f":"IF(H122=\"bye\",\"\",INDEX(spisak!$C$4:$C$308,MATCH(H122,spisak!$B$4:$B$542,0)))","v":{"$error":"#N/A"}},{"$nulls":9},""]
[122,"q2",28,null,null,{"$f":"grupe!C391","v":0},{"$f":"IF(F123=\"bye\",\"\",INDEX(spisak!$C$4:$C$308,MATCH(F123,spisak!$B$4:$B$542,0)))","v":{"$error":"#N/A"}},{"$f":"grupe!D391","v":0},{"$f":"IF(H123=\"bye\",\"\",INDEX(spisak!$C$4:$C$308,MATCH(H123,spisak!$B$4:$B$542,0)))","v":{"$error":"#N/A"}},{"$nulls":9},""]
[123,"q2",29,null,null,{"$f":"grupe!C404","v":0},{"$f":"IF(F124=\"bye\",\"\",INDEX(spisak!$C$4:$C$308,MATCH(F124,spisak!$B$4:$B$542,0)))","v":{"$error":"#N/A"}},{"$f":"grupe!D404","v":0},{"$f":"IF(H124=\"bye\",\"\",INDEX(spisak!$C$4:$C$308,MATCH(H124,spisak!$B$4:$B$542,0)))","v":{"$error":"#N/A"}},{"$nulls":9},""]
[124,"q2",29,null,null,{"$f":"grupe!C405","v":0},{"$f":"IF(F125=\"bye\",\"\",INDEX(spisak!$C$4:$C$308,MATCH(F125,spisak!$B$4:$B$542,0)))","v":{"$error":"#N/A"}},{"$f":"grupe!D405","v":0},{"$f":"IF(H125=\"bye\",\"\",INDEX(spisak!$C$4:$C$308,MATCH(H125,spisak!$B$4:$B$542,0)))","v":{"$error":"#N/A"}},{"$nulls":9},""]
[125,"q2",30,null,null,{"$f":"grupe!C418","v":0},{"$f":"IF(F126=\"bye\",\"\",INDEX(spisak!$C$4:$C$308,MATCH(F126,spisak!$B$4:$B$542,0)))","v":{"$error":"#N/A"}},{"$f":"grupe!D418","v":0},{"$f":"IF(H126=\"bye\",\"\",INDEX(spisak!$C$4:$C$308,MATCH(H126,spisak!$B$4:$B$542,0)))","v":{"$error":"#N/A"}},{"$nulls":9},""]
[126,"q2",30,null,null,{"$f":"grupe!C419","v":0},{"$f":"IF(F127=\"bye\",\"\",INDEX(spisak!$C$4:$C$308,MATCH(F127,spisak!$B$4:$B$542,0)))","v":{"$error":"#N/A"}},{"$f":"grupe!D419","v":0},{"$f":"IF(H127=\"bye\",\"\",INDEX(spisak!$C$4:$C$308,MATCH(H127,spisak!$B$4:$B$542,0)))","v":{"$error":"#N/A"}},{"$nulls":9},""]
[127,"q2",31,null,null,{"$f":"grupe!C432","v":0},{"$f":"IF(F128=\"bye\",\"\",INDEX(spisak!$C$4:$C$308,MATCH(F128,spisak!$B$4:$B$542,0)))","v":{"$error":"#N/A"}},{"$f":"grupe!D432","v":0},{"$f":"IF(H128=\"bye\",\"\",INDEX(spisak!$C$4:$C$308,MATCH(H128,spisak!$B$4:$B$542,0)))","v":{"$error":"#N/A"}},{"$nulls":9},""]
[128,"q2",31,null,null,{"$f":"grupe!C433","v":0},{"$f":"IF(F129=\"bye\",\"\",INDEX(spisak!$C$4:$C$308,MATCH(F129,spisak!$B$4:$B$542,0)))","v":{"$error":"#N/A"}},{"$f":"grupe!D433","v":0},{"$f":"IF(H129=\"bye\",\"\",INDEX(spisak!$C$4:$C$308,MATCH(H129,spisak!$B$4:$B$542,0)))","v":{"$error":"#N/A"}},{"$nulls":9},""]
[129,"q2",32,null,null,{"$f":"grupe!C446","v":0},{"$f":"IF(F130=\"bye\",\"\",INDEX(spisak!$C$4:$C$308,MATCH(F130,spisak!$B$4:$B$542,0)))","v":{"$error":"#N/A"}},{"$f":"grupe!D446","v":0},{"$f":"IF(H130=\"bye\",\"\",INDEX(spisak!$C$4:$C$308,MATCH(H130,spisak!$B$4:$B$542,0)))","v":{"$error":"#N/A"}},{"$nulls":9},{"$f":"IF(ISBLANK(J130),\"\",IF(J130>K130,F130,H130))","v":""}]
[130,"q2",32,null,null,{"$f":"grupe!C447","v":0},{"$f":"IF(F131=\"bye\",\"\",INDEX(spisak!$C$4:$C$308,MATCH(F131,spisak!$B$4:$B$542,0)))","v":{"$error":"#N/A"}},{"$f":"grupe!D447","v":0},{"$f":"IF(H131=\"bye\",\"\",INDEX(spisak!$C$4:$C$308,MATCH(H131,spisak!$B$4:$B$542,0)))","v":{"$error":"#N/A"}},{"$nulls":9},""]
[131,"q2",33,null,null,{"$f":"grupe!C460","v":0},{"$f":"IF(F132=\"bye\",\"\",INDEX(spisak!$C$4:$C$308,MATCH(F132,spisak!$B$4:$B$542,0)))","v":{"$error":"#N/A"}},{"$f":"grupe!D460","v":0},{"$f":"IF(H132=\"bye\",\"\",INDEX(spisak!$C$4:$C$308,MATCH(H132,spisak!$B$4:$B$542,0)))","v":{"$error":"#N/A"}},{"$nulls":9},""]
[132,"q2",33,null,null,{"$f":"grupe!C461","v":0},{"$f":"IF(F133=\"bye\",\"\",INDEX(spisak!$C$4:$C$308,MATCH(F133,spisak!$B$4:$B$542,0)))","v":{"$error":"#N/A"}},{"$f":"grupe!D461","v":0},{"$f":"IF(H133=\"bye\",\"\",INDEX(spisak!$C$4:$C$308,MATCH(H133,spisak!$B$4:$B$542,0)))","v":{"$error":"#N/A"}},{"$nulls":9},""]
[133,"q3",1,null,null,{"$f":"grupe!C14","v":"Ilić Bogdan"},{"$f":"IF(F134=\"bye\",\"\",INDEX(spisak!$C$4:$C$308,MATCH(F134,spisak!$B$4:$B$542,0)))","v":"Napad"},{"$f":"grupe!D14","v":"bye"},{"$f":"IF(H134=\"bye\",\"\",INDEX(spisak!$C$4:$C$308,MATCH(H134,spisak!$B$4:$B$542,0)))","v":""},{"$nulls":9},""]
[134,"q3",1,null,null,{"$f":"grupe!C15","v":"Ivančev Đorđe"},{"$f":"IF(F135=\"bye\",\"\",INDEX(spisak!$C$4:$C$308,MATCH(F135,spisak!$B$4:$B$542,0)))","v":"Sinđelić Beograd"},{"$f":"grupe!D15","v":"Zaharijev  Nikola"},{"$f":"IF(H135=\"bye\",\"\",INDEX(spisak!$C$4:$C$308,MATCH(H135,spisak!$B$4:$B$542,0)))","v":"Mladost Bosilegrad"},1,3,{"v":911,"d":"09-11"},{"v":411,"d":"04-11"},{"v":1103,"d":"11-03"},{"v":711,"d":"07-11"},{"$nulls":3},"Zaharijev  Nikola"]
[135,"q3",2,null,null,{"$f":"grupe!C28","v":"Šepa Matija"},{"$f":"IF(F136=\"bye\",\"\",INDEX(spisak!$C$4:$C$308,MATCH(F136,spisak!$B$4:$B$542,0)))","v":"Stak Zemun"},{"$f":"grupe!D28","v":"bye"},{"$f":"IF(H136=\"bye\",\"\",INDEX(spisak!$C$4:$C$308,MATCH(H136,spisak!$B$4:$B$542,0)))","v":""},{"$nulls":9},""]
[136,"q3",2,null,null,{"$f":"grupe!C29","v":"Putnik Dario"},{"$f":"IF(F137=\"bye\",\"\",INDEX(spisak!$C$4:$C$308,MATCH(F137,spisak!$B$4:$B$542,0)))","v":"Milenijum"},{"$f":"grupe!D29","v":"Jović Aleksandar"},{"$f":"IF(H137=\"bye\",\"\",INDEX(spisak!$C$4:$C$308,MATCH(H137,spisak!$B$4:$B$542,0)))","v":"Dubočica Leskovac"},3,0,{"v":1109,"d":"11-09"},{"v":1106,"d":"11-06"},{"v":1108,"d":"11-08"},{"$nulls":4},"Putnik Dario"]
[137,"q3",3,null,null,{"$f":"grupe!C42","v":"Stefanović Vanja"},{"$f":"IF(F138=\"bye\",\"\",INDEX(spisak!$C$4:$C$308,MATCH(F138,spisak!$B$4:$B$542,0)))","v":"Stak Zemun"},{"$f":"grupe!D42","v":"bye"},{"$f":"IF(H138=\"bye\",\"\",INDEX(spisak!$C$4:$C$308,MATCH(H138,spisak!$B$4:$B$542,0)))","v":""},{"$nulls":9},""]
[138,"q3",3,null,null,{"$f":"grupe!C43","v":"Kalinić Ilija"},{"$f":"IF(F139=\"bye\",\"\",INDEX(spisak!$C$4:$C$308,MATCH(F139,spisak!$B$4:$B$542,0)))","v":"Ugrinovci"},{"$f":"grupe!D43","v":"Velinović Miloš"},{"$f":"IF(H139=\"bye\",\"\",INDEX(spisak!$C$4:$C$308,MATCH(H139,spisak!$B$4:$B$542,0)))","v":"Belo Polje"},"w",0,{"$nulls":7},"Kalinić Ilija"]
[139,"q3",4,null,null,{"$f":"grupe!C56","v":"Pavlović Dušan"},{"$f":"IF(F140=\"bye\",\"\",INDEX(spisak!$C$4:$C$308,MATCH(F140,spisak!$B$4:$B$542,0)))","v":"Stak Zemun"},{"$f":"grupe!D56","v":"bye"},{"$f":"IF(H140=\"bye\",\"\",INDEX(spisak!$C$4:$C$308,MATCH(H140,spisak!$B$4:$B$542,0)))","v":""},{"$nulls":9},""]
[140,"q3",4,null,null,{"$f":"grupe!C57","v":"Miovčić Mihailo"},{"$f":"IF(F141=\"bye\",\"\",INDEX(spisak!$C$4:$C$308,MATCH(F141,spisak!$B$4:$B$542,0)))","v":"Sinđelić Beograd"},{"$f":"grupe!D57","v":"Dragin Luka"},{"$f":"IF(H141=\"bye\",\"\",INDEX(spisak!$C$4:$C$308,MATCH(H141,spisak!$B$4:$B$542,0)))","v":"Borac Čačak"},3,0,{"v":1103,"d":"11-03"},{"v":1103,"d":"11-03"},{"v":1106,"d":"11-06"},{"$nulls":4},"Miovčić Mihailo"]
[141,"q3",5,null,null,{"$f":"grupe!C70","v":"Jelikić Dimitrije"},{"$f":"IF(F142=\"bye\",\"\",INDEX(spisak!$C$4:$C$308,MATCH(F142,spisak!$B$4:$B$542,0)))","v":"Crvena Zvezda Beograd"},{"$f":"grupe!D70","v":"bye"},{"$f":"IF(H142=\"bye\",\"\",INDEX(spisak!$C$4:$C$308,MATCH(H142,spisak!$B$4:$B$542,0)))","v":""},{"$nulls":9},""]
[142,"q3",5,null,null,{"$f":"grupe!C71","v":"Kalinčević Vladimir"},{"$f":"IF(F143=\"bye\",\"\",INDEX(spisak!$C$4:$C$308,MATCH(F143,spisak!$B$4:$B$542,0)))","v":"Sinđelić Beograd"},{"$f":"grupe!D71","v":"Janićijević Ognjen"},{"$f":"IF(H143=\"bye\",\"\",INDEX(spisak!$C$4:$C$308,MATCH(H143,spisak!$B$4:$B$542,0)))","v":"Lala"},3,0,{"v":1105,"d":"11-05"},{"v":1103,"d":"11-03"},{"v":1108,"d":"11-08"},{"$nulls":4},"Kalinčević Vladimir"]
[143,"q3",6,null,null,{"$f":"grupe!C84","v":"Varga Danijel"},{"$f":"IF(F144=\"bye\",\"\",INDEX(spisak!$C$4:$C$308,MATCH(F144,spisak!$B$4:$B$542,0)))","v":"Temerin"},{"$f":"grupe!D84","v":"bye"},{"$f":"IF(H144=\"bye\",\"\",INDEX(spisak!$C$4:$C$308,MATCH(H144,spisak!$B$4:$B$542,0)))","v":""},{"$nulls":9},""]
[144,"q3",6,null,null,{"$f":"grupe!C85","v":"Marton Filip"},{"$f":"IF(F145=\"bye\",\"\",INDEX(spisak!$C$4:$C$308,MATCH(F145,spisak!$B$4:$B$542,0)))","v":"Doža"},{"$f":"grupe!D85","v":"Preslav Nikolov"},{"$f":"IF(H145=\"bye\",\"\",INDEX(spisak!$C$4:$C$308,MATCH(H145,spisak!$B$4:$B$542,0)))","v":"Bdinci Bugarska"},2,3,{"v":1107,"d":"11-07"},{"v":811,"d":"08-11"},{"v":611,"d":"06-11"},{"v":1109,"d":"11-09"},{"v":611,"d":"06-11"},null,null,"Preslav Nikolov"]
[145,"q3",7,null,null,{"$f":"grupe!C98","v":"Pavlović Dimitrije"},{"$f":"IF(F146=\"bye\",\"\",INDEX(spisak!$C$4:$C$308,MATCH(F146,spisak!$B$4:$B$542,0)))","v":"Stak Zemun"},{"$f":"grupe!D98","v":"bye"},{"$f":"IF(H146=\"bye\",\"\",INDEX(spisak!$C$4:$C$308,MATCH(H146,spisak!$B$4:$B$542,0)))","v":""},{"$nulls":9},""]
[146,"q3",7,null,null,{"$f":"grupe!C99","v":"Dragin Saša"},{"$f":"IF(F147=\"bye\",\"\",INDEX(spisak!$C$4:$C$308,MATCH(F147,spisak!$B$4:$B$542,0)))","v":"Borac Čačak"},{"$f":"grupe!D99","v":"Živadinović Dimitrije"},{"$f":"IF(H147=\"bye\",\"\",INDEX(spisak!$C$4:$C$308,MATCH(H147,spisak!$B$4:$B$542,0)))","v":"Železničar Niš"},"w",0,{"$nulls":7},"Dragin Saša"]
[147,"q3",8,null,null,{"$f":"grupe!C112","v":"Bošković Marko"},{"$f":"IF(F148=\"bye\",\"\",INDEX(spisak!$C$4:$C$308,MATCH(F148,spisak!$B$4:$B$542,0)))","v":"Stak Zemun"},{"$f":"grupe!D112","v":"bye"},{"$f":"IF(H148=\"bye\",\"\",INDEX(spisak!$C$4:$C$308,MATCH(H148,spisak!$B$4:$B$542,0)))","v":""},{"$nulls":9},""]
[148,"q3",8,null,null,{"$f":"grupe!C113","v":"Mladenović Ognjen"},{"$f":"IF(F149=\"bye\",\"\",INDEX(spisak!$C$4:$C$308,MATCH(F149,spisak!$B$4:$B$542,0)))","v":"Prva Petoletka"},{"$f":"grupe!D113","v":"Titovski Nenad"},{"$f":"IF(H149=\"bye\",\"\",INDEX(spisak!$C$4:$C$308,MATCH(H149,spisak!$B$4:$B$542,0)))","v":"Skoplje"},3,0,{"v":1105,"d":"11-05"},{"v":1108,"d":"11-08"},{"v":1109,"d":"11-09"},{"$nulls":4},"Mladenović Ognjen"]
[149,"q3",9,null,null,{"$f":"grupe!C126","v":"Ninković Uroš"},{"$f":"IF(F150=\"bye\",\"\",INDEX(spisak!$C$4:$C$308,MATCH(F150,spisak!$B$4:$B$542,0)))","v":"Stak Zemun"},{"$f":"grupe!D126","v":"bye"},{"$f":"IF(H150=\"bye\",\"\",INDEX(spisak!$C$4:$C$308,MATCH(H150,spisak!$B$4:$B$542,0)))","v":""},{"$nulls":9},""]
[150,"q3",9,null,null,{"$f":"grupe!C127","v":"Jovanović Đurađ"},{"$f":"IF(F151=\"bye\",\"\",INDEX(spisak!$C$4:$C$308,MATCH(F151,spisak!$B$4:$B$542,0)))","v":"Sinđelić Beograd"},{"$f":"grupe!D127","v":"Lazić Nemanja"},{"$f":"IF(H151=\"bye\",\"\",INDEX(spisak!$C$4:$C$308,MATCH(H151,spisak!$B$4:$B$542,0)))","v":"Lala"},3,0,{"v":1105,"d":"11-05"},{"v":1107,"d":"11-07"},{"v":1102,"d":"11-02"},{"$nulls":4},"Jovanović Đurađ"]
[151,"q3",10,null,null,{"$f":"grupe!C140","v":"Rajić Borislav"},{"$f":"IF(F152=\"bye\",\"\",INDEX(spisak!$C$4:$C$308,MATCH(F152,spisak!$B$4:$B$542,0)))","v":"Novi Sad"},{"$f":"grupe!D140","v":"bye"},{"$f":"IF(H152=\"bye\",\"\",INDEX(spisak!$C$4:$C$308,MATCH(H152,spisak!$B$4:$B$542,0)))","v":""},{"$nulls":9},""]
[152,"q3",10,null,null,{"$f":"grupe!C141","v":"Konstantinov Marko"},{"$f":"IF(F153=\"bye\",\"\",INDEX(spisak!$C$4:$C$308,MATCH(F153,spisak!$B$4:$B$542,0)))","v":"Vršac"},{"$f":"grupe!D141","v":"Ivailo Bojanov"},{"$f":"IF(H153=\"bye\",\"\",INDEX(spisak!$C$4:$C$308,MATCH(H153,spisak!$B$4:$B$542,0)))","v":"Bdinci Bugarska"},3,0,{"v":1108,"d":"11-08"},{"v":1210,"d":"12-10"},{"v":1101,"d":"11-01"},{"$nulls":4},"Konstantinov Marko"]
[153,"q3",11,null,null,{"$f":"grupe!C154","v":"Marinković Vasilije"},{"$f":"IF(F154=\"bye\",\"\",INDEX(spisak!$C$4:$C$308,MATCH(F154,spisak!$B$4:$B$542,0)))","v":"Barajevo"},{"$f":"grupe!D154","v":"bye"},{"$f":"IF(H154=\"bye\",\"\",INDEX(spisak!$C$4:$C$308,MATCH(H154,spisak!$B$4:$B$542,0)))","v":""},{"$nulls":9},""]
[154,"q3",11,null,null,{"$f":"grupe!C155","v":"Stefanović Luka"},{"$f":"IF(F155=\"bye\",\"\",INDEX(spisak!$C$4:$C$308,MATCH(F155,spisak!$B$4:$B$542,0)))","v":"Novi Sad"},{"$f":"grupe!D155","v":"Orolić Đorđe"},{"$f":"IF(H155=\"bye\",\"\",INDEX(spisak!$C$4:$C$308,MATCH(H155,spisak!$B$4:$B$542,0)))","v":"Napad"},3,1,{"v":1105,"d":"11-05"},{"v":1311,"d":"13-11"},{"v":811,"d":"08-11"},{"v":1210,"d":"12-10"},{"$nulls":3},"Stefanović Luka"]
[155,"q3",12,null,null,{"$f":"grupe!C168","v":"Radonjić Stefan"},{"$f":"IF(F156=\"bye\",\"\",INDEX(spisak!$C$4:$C$308,MATCH(F156,spisak!$B$4:$B$542,0)))","v":"Milenijum"},{"$f":"grupe!D168","v":"bye"},{"$f":"IF(H156=\"bye\",\"\",INDEX(spisak!$C$4:$C$308,MATCH(H156,spisak!$B$4:$B$542,0)))","v":""},{"$nulls":9},""]
[156,"q3",12,null,null,{"$f":"grupe!C169","v":"Marković Jovan"},{"$f":"IF(F157=\"bye\",\"\",INDEX(spisak!$C$4:$C$308,MATCH(F157,spisak!$B$4:$B$542,0)))","v":"Vojvodina  Novi Sad"},{"$f":"grupe!D169","v":"Ilič Gavrilo"},{"$f":"IF(H157=\"bye\",\"\",INDEX(spisak!$C$4:$C$308,MATCH(H157,spisak!$B$4:$B$542,0)))","v":"Dubočica Leskovac"},3,2,{"v":1106,"d":"11-06"},{"v":1214,"d":"12-14"},{"v":1012,"d":"10-12"},{"v":1105,"d":"11-05"},{"v":1108,"d":"11-08"},null,null,"Marković Jovan"]
[157,"q3",13,null,null,{"$f":"grupe!C182","v":"Miljuš Luka"},{"$f":"IF(F158=\"bye\",\"\",INDEX(spisak!$C$4:$C$308,MATCH(F158,spisak!$B$4:$B$542,0)))","v":"Vojvodina  Novi Sad"},{"$f":"grupe!D182","v":"bye"},{"$f":"IF(H158=\"bye\",\"\",INDEX(spisak!$C$4:$C$308,MATCH(H158,spisak!$B$4:$B$542,0)))","v":""},{"$nulls":9},""]
[158,"q3",13,null,null,{"$f":"grupe!C183","v":"Pucarević Pavle"},{"$f":"IF(F159=\"bye\",\"\",INDEX(spisak!$C$4:$C$308,MATCH(F159,spisak!$B$4:$B$542,0)))","v":"Hajduk Veljko"},{"$f":"grupe!D183","v":"Stojilković Aleksej"},{"$f":"IF(H159=\"bye\",\"\",INDEX(spisak!$C$4:$C$308,MATCH(H159,spisak!$B$4:$B$542,0)))","v":"Železničar Niš"},3,0,{"v":1103,"d":"11-03"},{"v":1104,"d":"11-04"},{"v":1106,"d":"11-06"},{"$nulls":4},"Pucarević Pavle"]
[159,"q3",14,null,null,{"$f":"grupe!C196","v":"Gerginov Vanja"},{"$f":"IF(F160=\"bye\",\"\",INDEX(spisak!$C$4:$C$308,MATCH(F160,spisak!$B$4:$B$542,0)))","v":"Novi Sad"},{"$f":"grupe!D196","v":"bye"},{"$f":"IF(H160=\"bye\",\"\",INDEX(spisak!$C$4:$C$308,MATCH(H160,spisak!$B$4:$B$542,0)))","v":""},{"$nulls":9},""]
[160,"q3",14,null,null,{"$f":"grupe!C197","v":"Sabadoš Matej"},{"$f":"IF(F161=\"bye\",\"\",INDEX(spisak!$C$4:$C$308,MATCH(F161,spisak!$B$4:$B$542,0)))","v":"Rusin"},{"$f":"grupe!D197","v":"Pavković Đorđe"},{"$f":"IF(H161=\"bye\",\"\",INDEX(spisak!$C$4:$C$308,MATCH(H161,spisak!$B$4:$B$542,0)))","v":"Ozren Sokobanja"},0,3,{"v":911,"d":"09-11"},{"v":711,"d":"07-11"},{"v":711,"d":"07-11"},{"$nulls":4},"Pavković Đorđe"]
[161,"q3",15,null,null,{"$f":"grupe!C210","v":"Rajić Dalibor"},{"$f":"IF(F162=\"bye\",\"\",INDEX(spisak!$C$4:$C$308,MATCH(F162,spisak!$B$4:$B$542,0)))","v":"Novi Sad"},{"$f":"grupe!D210","v":"bye"},{"$f":"IF(H162=\"bye\",\"\",INDEX(spisak!$C$4:$C$308,MATCH(H162,spisak!$B$4:$B$542,0)))","v":""},{"$nulls":9},{"$f":"IF(ISBLANK(J162),\"\",IF(J162>K162,F162,H162))","v":""}]
[162,"q3",15,null,null,{"$f":"grupe!C211","v":"Paunović Petar"},{"$f":"IF(F163=\"bye\",\"\",INDEX(spisak!$C$4:$C$308,MATCH(F163,spisak!$B$4:$B$542,0)))","v":"Stoni"},{"$f":"grupe!D211","v":"Aleksandar Todorov"},{"$f":"IF(H163=\"bye\",\"\",INDEX(spisak!$C$4:$C$308,MATCH(H163,spisak!$B$4:$B$542,0)))","v":"Bdinci Bugarska"},3,0,{"v":1102,"d":"11-02"},{"v":1104,"d":"11-04"},{"v":1106,"d":"11-06"},{"$nulls":4},"Paunović Petar"]
[163,"q3",16,null,null,{"$f":"grupe!C224","v":"Jozić Marino"},{"$f":"IF(F164=\"bye\",\"\",INDEX(spisak!$C$4:$C$308,MATCH(F164,spisak!$B$4:$B$542,0)))","v":"Spartak"},{"$f":"grupe!D224","v":"bye"},{"$f":"IF(H164=\"bye\",\"\",INDEX(spisak!$C$4:$C$308,MATCH(H164,spisak!$B$4:$B$542,0)))","v":""},{"$nulls":9},""]
[164,"q3",16,null,null,{"$f":"grupe!C225","v":"Vasić Bogdan"},{"$f":"IF(F165=\"bye\",\"\",INDEX(spisak!$C$4:$C$308,MATCH(F165,spisak!$B$4:$B$542,0)))","v":"Stoni"},{"$f":"grupe!D225","v":"Vičević Luka"},{"$f":"IF(H165=\"bye\",\"\",INDEX(spisak!$C$4:$C$308,MATCH(H165,spisak!$B$4:$B$542,0)))","v":"Barajevo"},3,0,{"v":1101,"d":"11-01"},{"v":1107,"d":"11-07"},{"v":1108,"d":"11-08"},{"$nulls":4},"Vasić Bogdan"]
[165,"q3",17,null,null,{"$f":"grupe!C238","v":0},{"$f":"IF(F166=\"bye\",\"\",INDEX(spisak!$C$4:$C$308,MATCH(F166,spisak!$B$4:$B$542,0)))","v":{"$error":"#N/A"}},{"$f":"grupe!D238","v":0},{"$f":"IF(H166=\"bye\",\"\",INDEX(spisak!$C$4:$C$308,MATCH(H166,spisak!$B$4:$B$542,0)))","v":{"$error":"#N/A"}},{"$nulls":9},""]
[166,"q3",17,null,null,{"$f":"grupe!C239","v":0},{"$f":"IF(F167=\"bye\",\"\",INDEX(spisak!$C$4:$C$308,MATCH(F167,spisak!$B$4:$B$542,0)))","v":{"$error":"#N/A"}},{"$f":"grupe!D239","v":0},{"$f":"IF(H167=\"bye\",\"\",INDEX(spisak!$C$4:$C$308,MATCH(H167,spisak!$B$4:$B$542,0)))","v":{"$error":"#N/A"}},{"$nulls":9},""]
[167,"q3",18,null,null,{"$f":"grupe!C252","v":0},{"$f":"IF(F168=\"bye\",\"\",INDEX(spisak!$C$4:$C$308,MATCH(F168,spisak!$B$4:$B$542,0)))","v":{"$error":"#N/A"}},{"$f":"grupe!D252","v":0},{"$f":"IF(H168=\"bye\",\"\",INDEX(spisak!$C$4:$C$308,MATCH(H168,spisak!$B$4:$B$542,0)))","v":{"$error":"#N/A"}},{"$nulls":9},""]
[168,"q3",18,null,null,{"$f":"grupe!C253","v":0},{"$f":"IF(F169=\"bye\",\"\",INDEX(spisak!$C$4:$C$308,MATCH(F169,spisak!$B$4:$B$542,0)))","v":{"$error":"#N/A"}},{"$f":"grupe!D253","v":0},{"$f":"IF(H169=\"bye\",\"\",INDEX(spisak!$C$4:$C$308,MATCH(H169,spisak!$B$4:$B$542,0)))","v":{"$error":"#N/A"}},{"$nulls":9},""]
[169,"q3",19,null,null,{"$f":"grupe!C266","v":0},{"$f":"IF(F170=\"bye\",\"\",INDEX(spisak!$C$4:$C$308,MATCH(F170,spisak!$B$4:$B$542,0)))","v":{"$error":"#N/A"}},{"$f":"grupe!D266","v":0},{"$f":"IF(H170=\"bye\",\"\",INDEX(spisak!$C$4:$C$308,MATCH(H170,spisak!$B$4:$B$542,0)))","v":{"$error":"#N/A"}},{"$nulls":9},""]
[170,"q3",19,null,null,{"$f":"grupe!C267","v":0},{"$f":"IF(F171=\"bye\",\"\",INDEX(spisak!$C$4:$C$308,MATCH(F171,spisak!$B$4:$B$542,0)))","v":{"$error":"#N/A"}},{"$f":"grupe!D267","v":0},{"$f":"IF(H171=\"bye\",\"\",INDEX(spisak!$C$4:$C$308,MATCH(H171,spisak!$B$4:$B$542,0)))","v":{"$error":"#N/A"}},{"$nulls":9},""]
[171,"q3",20,null,null,{"$f":"grupe!C280","v":0},{"$f":"IF(F172=\"bye\",\"\",INDEX(spisak!$C$4:$C$308,MATCH(F172,spisak!$B$4:$B$542,0)))","v":{"$error":"#N/A"}},{"$f":"grupe!D280","v":0},{"$f":"IF(H172=\"bye\",\"\",INDEX(spisak!$C$4:$C$308,MATCH(H172,spisak!$B$4:$B$542,0)))","v":{"$error":"#N/A"}},{"$nulls":9},""]
[172,"q3",20,null,null,{"$f":"grupe!C281","v":0},{"$f":"IF(F173=\"bye\",\"\",INDEX(spisak!$C$4:$C$308,MATCH(F173,spisak!$B$4:$B$542,0)))","v":{"$error":"#N/A"}},{"$f":"grupe!D281","v":0},{"$f":"IF(H173=\"bye\",\"\",INDEX(spisak!$C$4:$C$308,MATCH(H173,spisak!$B$4:$B$542,0)))","v":{"$error":"#N/A"}},{"$nulls":9},""]
[173,"q3",21,null,null,{"$f":"grupe!C294","v":0},{"$f":"IF(F174=\"bye\",\"\",INDEX(spisak!$C$4:$C$308,MATCH(F174,spisak!$B$4:$B$542,0)))","v":{"$error":"#N/A"}},{"$f":"grupe!D294","v":0},{"$f":"IF(H174=\"bye\",\"\",INDEX(spisak!$C$4:$C$308,MATCH(H174,spisak!$B$4:$B$542,0)))","v":{"$error":"#N/A"}},{"$nulls":9},""]
[174,"q3",21,null,null,{"$f":"grupe!C295","v":0},{"$f":"IF(F175=\"bye\",\"\",INDEX(spisak!$C$4:$C$308,MATCH(F175,spisak!$B$4:$B$542,0)))","v":{"$error":"#N/A"}},{"$f":"grupe!D295","v":0},{"$f":"IF(H175=\"bye\",\"\",INDEX(spisak!$C$4:$C$308,MATCH(H175,spisak!$B$4:$B$542,0)))","v":{"$error":"#N/A"}},{"$nulls":9},""]
[175,"q3",22,null,null,{"$f":"grupe!C308","v":0},{"$f":"IF(F176=\"bye\",\"\",INDEX(spisak!$C$4:$C$308,MATCH(F176,spisak!$B$4:$B$542,0)))","v":{"$error":"#N/A"}},{"$f":"grupe!D308","v":0},{"$f":"IF(H176=\"bye\",\"\",INDEX(spisak!$C$4:$C$308,MATCH(H176,spisak!$B$4:$B$542,0)))","v":{"$error":"#N/A"}},{"$nulls":9},""]
[176,"q3",22,null,null,{"$f":"grupe!C309","v":0},{"$f":"IF(F177=\"bye\",\"\",INDEX(spisak!$C$4:$C$308,MATCH(F177,spisak!$B$4:$B$542,0)))","v":{"$error":"#N/A"}},{"$f":"grupe!D309","v":0},{"$f":"IF(H177=\"bye\",\"\",INDEX(spisak!$C$4:$C$308,MATCH(H177,spisak!$B$4:$B$542,0)))","v":{"$error":"#N/A"}},{"$nulls":9},""]
[177,"q3",23,null,null,{"$f":"grupe!C322","v":0},{"$f":"IF(F178=\"bye\",\"\",INDEX(spisak!$C$4:$C$308,MATCH(F178,spisak!$B$4:$B$542,0)))","v":{"$error":"#N/A"}},{"$f":"grupe!D322","v":0},{"$f":"IF(H178=\"bye\",\"\",INDEX(spisak!$C$4:$C$308,MATCH(H178,spisak!$B$4:$B$542,0)))","v":{"$error":"#N/A"}},{"$nulls":9},""]
[178,"q3",23,null,null,{"$f":"grupe!C323","v":0},{"$f":"IF(F179=\"bye\",\"\",INDEX(spisak!$C$4:$C$308,MATCH(F179,spisak!$B$4:$B$542,0)))","v":{"$error":"#N/A"}},{"$f":"grupe!D323","v":0},{"$f":"IF(H179=\"bye\",\"\",INDEX(spisak!$C$4:$C$308,MATCH(H179,spisak!$B$4:$B$542,0)))","v":{"$error":"#N/A"}},{"$nulls":9},""]
[179,"q3",24,null,null,{"$f":"grupe!C336","v":0},{"$f":"IF(F180=\"bye\",\"\",INDEX(spisak!$C$4:$C$308,MATCH(F180,spisak!$B$4:$B$542,0)))","v":{"$error":"#N/A"}},{"$f":"grupe!D336","v":0},{"$f":"IF(H180=\"bye\",\"\",INDEX(spisak!$C$4:$C$308,MATCH(H180,spisak!$B$4:$B$542,0)))","v":{"$error":"#N/A"}},{"$nulls":9},""]
[180,"q3",24,null,null,{"$f":"grupe!C337","v":0},{"$f":"IF(F181=\"bye\",\"\",INDEX(spisak!$C$4:$C$308,MATCH(F181,spisak!$B$4:$B$542,0)))","v":{"$error":"#N/A"}},{"$f":"grupe!D337","v":0},{"$f":"IF(H181=\"bye\",\"\",INDEX(spisak!$C$4:$C$308,MATCH(H181,spisak!$B$4:$B$542,0)))","v":{"$error":"#N/A"}},{"$nulls":9},""]
[181,"q3",25,null,null,{"$f":"grupe!C350","v":0},{"$f":"IF(F182=\"bye\",\"\",INDEX(spisak!$C$4:$C$308,MATCH(F182,spisak!$B$4:$B$542,0)))","v":{"$error":"#N/A"}},{"$f":"grupe!D350","v":0},{"$f":"IF(H182=\"bye\",\"\",INDEX(spisak!$C$4:$C$308,MATCH(H182,spisak!$B$4:$B$542,0)))","v":{"$error":"#N/A"}},{"$nulls":9},""]
[182,"q3",25,null,null,{"$f":"grupe!C351","v":0},{"$f":"IF(F183=\"bye\",\"\",INDEX(spisak!$C$4:$C$308,MATCH(F183,spisak!$B$4:$B$542,0)))","v":{"$error":"#N/A"}},{"$f":"grupe!D351","v":0},{"$f":"IF(H183=\"bye\",\"\",INDEX(spisak!$C$4:$C$308,MATCH(H183,spisak!$B$4:$B$542,0)))","v":{"$error":"#N/A"}},{"$nulls":9},""]
[183,"q3",26,null,null,{"$f":"grupe!C364","v":0},{"$f":"IF(F184=\"bye\",\"\",INDEX(spisak!$C$4:$C$308,MATCH(F184,spisak!$B$4:$B$542,0)))","v":{"$error":"#N/A"}},{"$f":"grupe!D364","v":0},{"$f":"IF(H184=\"bye\",\"\",INDEX(spisak!$C$4:$C$308,MATCH(H184,spisak!$B$4:$B$542,0)))","v":{"$error":"#N/A"}},{"$nulls":9},""]
[184,"q3",26,null,null,{"$f":"grupe!C365","v":0},{"$f":"IF(F185=\"bye\",\"\",INDEX(spisak!$C$4:$C$308,MATCH(F185,spisak!$B$4:$B$542,0)))","v":{"$error":"#N/A"}},{"$f":"grupe!D365","v":0},{"$f":"IF(H185=\"bye\",\"\",INDEX(spisak!$C$4:$C$308,MATCH(H185,spisak!$B$4:$B$542,0)))","v":{"$error":"#N/A"}},{"$nulls":9},""]
[185,"q3",27,null,null,{"$f":"grupe!C378","v":0},{"$f":"IF(F186=\"bye\",\"\",INDEX(spisak!$C$4:$C$308,MATCH(F186,spisak!$B$4:$B$542,0)))","v":{"$error":"#N/A"}},{"$f":"grupe!D378","v":0},{"$f":"IF(H186=\"bye\",\"\",INDEX(spisak!$C$4:$C$308,MATCH(H186,spisak!$B$4:$B$542,0)))","v":{"$error":"#N/A"}},{"$nulls":9},""]
[186,"q3",27,null,null,{"$f":"grupe!C379","v":0},{"$f":"IF(F187=\"bye\",\"\",INDEX(spisak!$C$4:$C$308,MATCH(F187,spisak!$B$4:$B$542,0)))","v":{"$error":"#N/A"}},{"$f":"grupe!D379","v":0},{"$f":"IF(H187=\"bye\",\"\",INDEX(spisak!$C$4:$C$308,MATCH(H187,spisak!$B$4:$B$542,0)))","v":{"$error":"#N/A"}},{"$nulls":9},""]
[187,"q3",28,null,null,{"$f":"grupe!C392","v":0},{"$f":"IF(F188=\"bye\",\"\",INDEX(spisak!$C$4:$C$308,MATCH(F188,spisak!$B$4:$B$542,0)))","v":{"$error":"#N/A"}},{"$f":"grupe!D392","v":0},{"$f":"IF(H188=\"bye\",\"\",INDEX(spisak!$C$4:$C$308,MATCH(H188,spisak!$B$4:$B$542,0)))","v":{"$error":"#N/A"}},{"$nulls":9},""]
[188,"q3",28,null,null,{"$f":"grupe!C393","v":0},{"$f":"IF(F189=\"bye\",\"\",INDEX(spisak!$C$4:$C$308,MATCH(F189,spisak!$B$4:$B$542,0)))","v":{"$error":"#N/A"}},{"$f":"grupe!D393","v":0},{"$f":"IF(H189=\"bye\",\"\",INDEX(spisak!$C$4:$C$308,MATCH(H189,spisak!$B$4:$B$542,0)))","v":{"$error":"#N/A"}},{"$nulls":9},""]
[189,"q3",29,null,null,{"$f":"grupe!C406","v":0},{"$f":"IF(F190=\"bye\",\"\",INDEX(spisak!$C$4:$C$308,MATCH(F190,spisak!$B$4:$B$542,0)))","v":{"$error":"#N/A"}},{"$f":"grupe!D406","v":0},{"$f":"IF(H190=\"bye\",\"\",INDEX(spisak!$C$4:$C$308,MATCH(H190,spisak!$B$4:$B$542,0)))","v":{"$error":"#N/A"}},{"$nulls":9},""]
[190,"q3",29,null,null,{"$f":"grupe!C407","v":0},{"$f":"IF(F191=\"bye\",\"\",INDEX(spisak!$C$4:$C$308,MATCH(F191,spisak!$B$4:$B$542,0)))","v":{"$error":"#N/A"}},{"$f":"grupe!D407","v":0},{"$f":"IF(H191=\"bye\",\"\",INDEX(spisak!$C$4:$C$308,MATCH(H191,spisak!$B$4:$B$542,0)))","v":{"$error":"#N/A"}},{"$nulls":9},""]
[191,"q3",30,null,null,{"$f":"grupe!C420","v":0},{"$f":"IF(F192=\"bye\",\"\",INDEX(spisak!$C$4:$C$308,MATCH(F192,spisak!$B$4:$B$542,0)))","v":{"$error":"#N/A"}},{"$f":"grupe!D420","v":0},{"$f":"IF(H192=\"bye\",\"\",INDEX(spisak!$C$4:$C$308,MATCH(H192,spisak!$B$4:$B$542,0)))","v":{"$error":"#N/A"}},{"$nulls":9},""]
[192,"q3",30,null,null,{"$f":"grupe!C421","v":0},{"$f":"IF(F193=\"bye\",\"\",INDEX(spisak!$C$4:$C$308,MATCH(F193,spisak!$B$4:$B$542,0)))","v":{"$error":"#N/A"}},{"$f":"grupe!D421","v":0},{"$f":"IF(H193=\"bye\",\"\",INDEX(spisak!$C$4:$C$308,MATCH(H193,spisak!$B$4:$B$542,0)))","v":{"$error":"#N/A"}},{"$nulls":9},""]
[193,"q3",31,null,null,{"$f":"grupe!C434","v":0},{"$f":"IF(F194=\"bye\",\"\",INDEX(spisak!$C$4:$C$308,MATCH(F194,spisak!$B$4:$B$542,0)))","v":{"$error":"#N/A"}},{"$f":"grupe!D434","v":0},{"$f":"IF(H194=\"bye\",\"\",INDEX(spisak!$C$4:$C$308,MATCH(H194,spisak!$B$4:$B$542,0)))","v":{"$error":"#N/A"}},{"$nulls":9},{"$f":"IF(ISBLANK(J194),\"\",IF(J194>K194,F194,H194))","v":""}]
[194,"q3",31,null,null,{"$f":"grupe!C435","v":0},{"$f":"IF(F195=\"bye\",\"\",INDEX(spisak!$C$4:$C$308,MATCH(F195,spisak!$B$4:$B$542,0)))","v":{"$error":"#N/A"}},{"$f":"grupe!D435","v":0},{"$f":"IF(H195=\"bye\",\"\",INDEX(spisak!$C$4:$C$308,MATCH(H195,spisak!$B$4:$B$542,0)))","v":{"$error":"#N/A"}},{"$nulls":9},""]
[195,"q3",32,null,null,{"$f":"grupe!C448","v":0},{"$f":"IF(F196=\"bye\",\"\",INDEX(spisak!$C$4:$C$308,MATCH(F196,spisak!$B$4:$B$542,0)))","v":{"$error":"#N/A"}},{"$f":"grupe!D448","v":0},{"$f":"IF(H196=\"bye\",\"\",INDEX(spisak!$C$4:$C$308,MATCH(H196,spisak!$B$4:$B$542,0)))","v":{"$error":"#N/A"}},{"$nulls":9},""]
[196,"q3",32,null,null,{"$f":"grupe!C449","v":0},{"$f":"IF(F197=\"bye\",\"\",INDEX(spisak!$C$4:$C$308,MATCH(F197,spisak!$B$4:$B$542,0)))","v":{"$error":"#N/A"}},{"$f":"grupe!D449","v":0},{"$f":"IF(H197=\"bye\",\"\",INDEX(spisak!$C$4:$C$308,MATCH(H197,spisak!$B$4:$B$542,0)))","v":{"$error":"#N/A"}},{"$nulls":9},""]
[197,"q3",33,null,null,{"$f":"grupe!C462","v":0},{"$f":"IF(F198=\"bye\",\"\",INDEX(spisak!$C$4:$C$308,MATCH(F198,spisak!$B$4:$B$542,0)))","v":{"$error":"#N/A"}},{"$f":"grupe!D462","v":0},{"$f":"IF(H198=\"bye\",\"\",INDEX(spisak!$C$4:$C$308,MATCH(H198,spisak!$B$4:$B$542,0)))","v":{"$error":"#N/A"}},{"$nulls":9},""]
[198,"q3",33,null,null,{"$f":"grupe!C463","v":0},{"$f":"IF(F199=\"bye\",\"\",INDEX(spisak!$C$4:$C$308,MATCH(F199,spisak!$B$4:$B$542,0)))","v":{"$error":"#N/A"}},{"$f":"grupe!D463","v":0},{"$f":"IF(H199=\"bye\",\"\",INDEX(spisak!$C$4:$C$308,MATCH(H199,spisak!$B$4:$B$542,0)))","v":{"$error":"#N/A"}},{"$nulls":9},""]
[199,1,"gz",null,null,{"$f":"IF(ISBLANK('32'!C3),\"bye\",'32'!C3)","v":"Ilić Bogdan"},{"$f":"IF(F200=\"bye\",\"\",INDEX(spisak!$C$4:$C$308,MATCH(F200,spisak!$B$4:$B$542,0)))","v":"Napad"},{"$f":"IF(ISBLANK('32'!C4),\"bye\",'32'!C4)","v":"Putnik Dario"},{"$f":"IF(H200=\"bye\",\"\",INDEX(spisak!$C$4:$C$308,MATCH(H200,spisak!$B$4:$B$542,0)))","v":"Milenijum"},3,0,{"v":1103,"d":"11-03"},{"v":1104,"d":"11-04"},{"v":1107,"d":"11-07"},{"$nulls":4},{"$f":"IF(AND(F200=\"bye\",H200=\"bye\"),\"bye\",IF(F200=\"bye\",H200,IF(H200=\"bye\",F200,IF(ISBLANK(J200),\"bye\",IF(J200>K200,F200,H200)))))","v":"Ilić Bogdan"},{"$f":"IF(AND(F200=\"bye\",H200=\"bye\"),\"bye\",IF(F200=\"bye\",H200,IF(H200=\"bye\",F200,IF(ISBLANK(J200),\"bye\",IF(J200>K200,H200,F200)))))","v":"Putnik Dario"}]
[200,1,"gz",null,null,{"$f":"IF(ISBLANK('32'!C6),\"bye\",'32'!C6)","v":"Pavković Đorđe"},{"$f":"IF(F201=\"bye\",\"\",INDEX(spisak!$C$4:$C$308,MATCH(F201,spisak!$B$4:$B$542,0)))","v":"Ozren Sokobanja"},{"$f":"IF(ISBLANK('32'!C8),\"bye\",'32'!C8)","v":"Rajić Borislav"},{"$f":"IF(H201=\"bye\",\"\",INDEX(spisak!$C$4:$C$308,MATCH(H201,spisak!$B$4:$B$542,0)))","v":"Novi Sad"},3,2,{"v":1107,"d":"11-07"},{"v":811,"d":"08-11"},{"v":1109,"d":"11-09"},{"v":511,"d":"05-11"},{"v":1311,"d":"13-11"},null,null,"Pavković Đorđe","Rajić Borislav"]
[201,1,"gz",null,null,{"$f":"IF(ISBLANK('32'!C10),\"bye\",'32'!C10)","v":"Miljuš Luka"},{"$f":"IF(F202=\"bye\",\"\",INDEX(spisak!$C$4:$C$308,MATCH(F202,spisak!$B$4:$B$542,0)))","v":"Vojvodina  Novi Sad"},{"$f":"IF(ISBLANK('32'!C12),\"bye\",'32'!C12)","v":"Stefanović Luka"},{"$f":"IF(H202=\"bye\",\"\",INDEX(spisak!$C$4:$C$308,MATCH(H202,spisak!$B$4:$B$542,0)))","v":"Novi Sad"},3,1,{"v":811,"d":"08-11"},{"v":1106,"d":"11-06"},{"v":1108,"d":"11-08"},{"v":1102,"d":"11-02"},{"$nulls":3},"Miljuš Luka","Stefanović Luka"]
[202,1,"gz",null,null,{"$f":"IF(ISBLANK('32'!C14),\"bye\",'32'!C14)","v":"Vasić Bogdan"},{"$f":"IF(F203=\"bye\",\"\",INDEX(spisak!$C$4:$C$308,MATCH(F203,spisak!$B$4:$B$542,0)))","v":"Stoni"},{"$f":"IF(ISBLANK('32'!C16),\"bye\",'32'!C16)","v":"Pavlović Dimitrije"},{"$f":"IF(H203=\"bye\",\"\",INDEX(spisak!$C$4:$C$308,MATCH(H203,spisak!$B$4:$B$542,0)))","v":"Stak Zemun"},0,3,{"v":811,"d":"08-11"},{"v":911,"d":"09-11"},{"v":311,"d":"03-11"},{"$nulls":4},"Pavlović Dimitrije","Vasić Bogdan"]
[203,1,"gz",null,null,{"$f":"IF(ISBLANK('32'!C18),\"bye\",'32'!C18)","v":"Varga Danijel"},{"$f":"IF(F204=\"bye\",\"\",INDEX(spisak!$C$4:$C$308,MATCH(F204,spisak!$B$4:$B$542,0)))","v":"Temerin"},{"$f":"IF(ISBLANK('32'!C20),\"bye\",'32'!C20)","v":"Marković Jovan"},{"$f":"IF(H204=\"bye\",\"\",INDEX(spisak!$C$4:$C$308,MATCH(H204,spisak!$B$4:$B$542,0)))","v":"Vojvodina  Novi Sad"},3,1,{"v":1103,"d":"11-03"},{"v":811,"d":"08-11"},{"v":1109,"d":"11-09"},{"v":1104,"d":"11-04"},{"$nulls":3},"Varga Danijel","Marković Jovan"]
[204,1,"gz",null,null,{"$f":"IF(ISBLANK('32'!C22),\"bye\",'32'!C22)","v":"Kalinčević Vladimir"},{"$f":"IF(F205=\"bye\",\"\",INDEX(spisak!$C$4:$C$308,MATCH(F205,spisak!$B$4:$B$542,0)))","v":"Sinđelić Beograd"},{"$f":"IF(ISBLANK('32'!C24),\"bye\",'32'!C24)","v":"Ninković Uroš"},{"$f":"IF(H205=\"bye\",\"\",INDEX(spisak!$C$4:$C$308,MATCH(H205,spisak!$B$4:$B$542,0)))","v":"Stak Zemun"},0,3,{"v":711,"d":"07-11"},{"v":511,"d":"05-11"},{"v":711,"d":"07-11"},{"$nulls":4},"Ninković Uroš","Kalinčević Vladimir"]
[205,1,"gz",null,null,{"$f":"IF(ISBLANK('32'!C26),\"bye\",'32'!C26)","v":"Paunović Petar"},{"$f":"IF(F206=\"bye\",\"\",INDEX(spisak!$C$4:$C$308,MATCH(F206,spisak!$B$4:$B$542,0)))","v":"Stoni"},{"$f":"IF(ISBLANK('32'!C28),\"bye\",'32'!C28)","v":"Mladenović Ognjen"},{"$f":"IF(H206=\"bye\",\"\",INDEX(spisak!$C$4:$C$308,MATCH(H206,spisak!$B$4:$B$542,0)))","v":"Prva Petoletka"},3,0,{"v":1108,"d":"11-08"},{"v":1102,"d":"11-02"},{"v":1107,"d":"11-07"},{"$nulls":4},"Paunović Petar","Mladenović Ognjen"]
[206,1,"gz",null,null,{"$f":"IF(ISBLANK('32'!C30),\"bye\",'32'!C30)","v":"Velinović Miloš"},{"$f":"IF(F207=\"bye\",\"\",INDEX(spisak!$C$4:$C$308,MATCH(F207,spisak!$B$4:$B$542,0)))","v":"Belo Polje"},{"$f":"IF(ISBLANK('32'!C32),\"bye\",'32'!C32)","v":"Pavlović Dušan"},{"$f":"IF(H207=\"bye\",\"\",INDEX(spisak!$C$4:$C$308,MATCH(H207,spisak!$B$4:$B$542,0)))","v":"Stak Zemun"},0,3,{"v":511,"d":"05-11"},{"v":411,"d":"04-11"},{"v":311,"d":"03-11"},{"$nulls":4},"Pavlović Dušan","Velinović Miloš"]
[207,1,"gz",null,null,{"$f":"IF(ISBLANK('32'!C34),\"bye\",'32'!C34)","v":"Stefanović Vanja"},{"$f":"IF(F208=\"bye\",\"\",INDEX(spisak!$C$4:$C$308,MATCH(F208,spisak!$B$4:$B$542,0)))","v":"Stak Zemun"},{"$f":"IF(ISBLANK('32'!C36),\"bye\",'32'!C36)","v":"Preslav Nikolov"},{"$f":"IF(H208=\"bye\",\"\",INDEX(spisak!$C$4:$C$308,MATCH(H208,spisak!$B$4:$B$542,0)))","v":"Bdinci Bugarska"},3,0,{"v":1106,"d":"11-06"},{"v":1108,"d":"11-08"},{"v":1101,"d":"11-01"},{"$nulls":4},"Stefanović Vanja","Preslav Nikolov"]
[208,1,"gz",null,null,{"$f":"IF(ISBLANK('32'!C38),\"bye\",'32'!C38)","v":"Dragin Saša"},{"$f":"IF(F209=\"bye\",\"\",INDEX(spisak!$C$4:$C$308,MATCH(F209,spisak!$B$4:$B$542,0)))","v":"Borac Čačak"},{"$f":"IF(ISBLANK('32'!C40),\"bye\",'32'!C40)","v":"Radonjić Stefan"},{"$f":"IF(H209=\"bye\",\"\",INDEX(spisak!$C$4:$C$308,MATCH(H209,spisak!$B$4:$B$542,0)))","v":"Milenijum"},0,3,{"v":611,"d":"06-11"},{"v":611,"d":"06-11"},{"v":511,"d":"05-11"},{"$nulls":4},"Radonjić Stefan","Dragin Saša"]
[209,1,"gz",null,null,{"$f":"IF(ISBLANK('32'!C42),\"bye\",'32'!C42)","v":"Jozić Marino"},{"$f":"IF(F210=\"bye\",\"\",INDEX(spisak!$C$4:$C$308,MATCH(F210,spisak!$B$4:$B$542,0)))","v":"Spartak"},{"$f":"IF(ISBLANK('32'!C44),\"bye\",'32'!C44)","v":"Zaharijev  Nikola"},{"$f":"IF(H210=\"bye\",\"\",INDEX(spisak!$C$4:$C$308,MATCH(H210,spisak!$B$4:$B$542,0)))","v":"Mladost Bosilegrad"},3,0,{"v":1103,"d":"11-03"},{"v":1105,"d":"11-05"},{"v":311,"d":"03-11"},{"v":1107,"d":"11-07"},{"$nulls":3},"Jozić Marino","Zaharijev  Nikola"]
[210,1,"gz",null,null,{"$f":"IF(ISBLANK('32'!C46),\"bye\",'32'!C46)","v":"Jovanović Đurađ"},{"$f":"IF(F211=\"bye\",\"\",INDEX(spisak!$C$4:$C$308,MATCH(F211,spisak!$B$4:$B$542,0)))","v":"Sinđelić Beograd"},{"$f":"IF(ISBLANK('32'!C48),\"bye\",'32'!C48)","v":"Jelikić Dimitrije"},{"$f":"IF(H211=\"bye\",\"\",INDEX(spisak!$C$4:$C$308,MATCH(H211,spisak!$B$4:$B$542,0)))","v":"Crvena Zvezda Beograd"},0,3,{"v":211,"d":"02-11"},{"v":611,"d":"06-11"},{"v":611,"d":"06-11"},{"$nulls":4},"Jelikić Dimitrije","Jovanović Đurađ"]
[211,1,"gz",null,null,{"$f":"IF(ISBLANK('32'!C50),\"bye\",'32'!C50)","v":"Bošković Marko"},{"$f":"IF(F212=\"bye\",\"\",INDEX(spisak!$C$4:$C$308,MATCH(F212,spisak!$B$4:$B$542,0)))","v":"Stak Zemun"},{"$f":"IF(ISBLANK('32'!C52),\"bye\",'32'!C52)","v":"Pucarević Pavle"},{"$f":"IF(H212=\"bye\",\"\",INDEX(spisak!$C$4:$C$308,MATCH(H212,spisak!$B$4:$B$542,0)))","v":"Hajduk Veljko"},3,1,{"v":1109,"d":"11-09"},{"v":1109,"d":"11-09"},{"v":911,"d":"09-11"},{"v":1311,"d":"13-11"},{"$nulls":3},"Bošković Marko","Pucarević Pavle"]
[212,1,"gz",null,null,{"$f":"IF(ISBLANK('32'!C54),\"bye\",'32'!C54)","v":"Rajić Dalibor"},{"$f":"IF(F213=\"bye\",\"\",INDEX(spisak!$C$4:$C$308,MATCH(F213,spisak!$B$4:$B$542,0)))","v":"Novi Sad"},{"$f":"IF(ISBLANK('32'!C56),\"bye\",'32'!C56)","v":"Marinković Vasilije"},{"$f":"IF(H213=\"bye\",\"\",INDEX(spisak!$C$4:$C$308,MATCH(H213,spisak!$B$4:$B$542,0)))","v":"Barajevo"},3,0,{"v":1106,"d":"11-06"},{"v":1106,"d":"11-06"},{"v":1102,"d":"11-02"},{"$nulls":4},"Rajić Dalibor","Marinković Vasilije"]
[213,1,"gz",null,null,{"$f":"IF(ISBLANK('32'!C58),\"bye\",'32'!C58)","v":"Gerginov Vanja"},{"$f":"IF(F214=\"bye\",\"\",INDEX(spisak!$C$4:$C$308,MATCH(F214,spisak!$B$4:$B$542,0)))","v":"Novi Sad"},{"$f":"IF(ISBLANK('32'!C60),\"bye\",'32'!C60)","v":"Konstantinov Marko"},{"$f":"IF(H214=\"bye\",\"\",INDEX(spisak!$C$4:$C$308,MATCH(H214,spisak!$B$4:$B$542,0)))","v":"Vršac"},3,2,{"v":1210,"d":"12-10"},{"v":1113,"d":"11-13"},{"v":1104,"d":"11-04"},{"v":611,"d":"06-11"},{"v":1109,"d":"11-09"},null,null,"Gerginov Vanja","Konstantinov Marko"]
[214,1,"gz",null,null,{"$f":"IF(ISBLANK('32'!C62),\"***\",'32'!C62)","v":"Miovčić Mihailo"},{"$f":"IF(F215=\"bye\",\"\",INDEX(spisak!$C$4:$C$308,MATCH(F215,spisak!$B$4:$B$542,0)))","v":"Sinđelić Beograd"},{"$f":"IF(ISBLANK('32'!C64),\"***\",'32'!C64)","v":"Šepa Matija"},{"$f":"IF(H215=\"bye\",\"\",INDEX(spisak!$C$4:$C$308,MATCH(H215,spisak!$B$4:$B$542,0)))","v":"Stak Zemun"},0,3,{"v":211,"d":"02-11"},{"v":411,"d":"04-11"},{"v":711,"d":"07-11"},{"$nulls":4},"Šepa Matija","Miovčić Mihailo"]
[215,2,"gz",null,null,{"$f":"S200","v":"Ilić Bogdan"},{"$f":"IF(F216=\"bye\",\"\",INDEX(spisak!$C$4:$C$308,MATCH(F216,spisak!$B$4:$B$542,0)))","v":"Napad"},{"$f":"S201","v":"Pavković Đorđe"},{"$f":"IF(H216=\"bye\",\"\",INDEX(spisak!$C$4:$C$308,MATCH(H216,spisak!$B$4:$B$542,0)))","v":"Ozren Sokobanja"},3,0,{"v":1104,"d":"11-04"},{"v":1105,"d":"11-05"},{"v":1210,"d":"12-10"},{"$nulls":4},"Ilić Bogdan","Pavković Đorđe"]
[216,2,"gz",null,null,{"$f":"S202","v":"Miljuš Luka"},{"$f":"IF(F217=\"bye\",\"\",INDEX(spisak!$C$4:$C$308,MATCH(F217,spisak!$B$4:$B$542,0)))","v":"Vojvodina  Novi Sad"},{"$f":"S203","v":"Pavlović Dimitrije"},{"$f":"IF(H217=\"bye\",\"\",INDEX(spisak!$C$4:$C$308,MATCH(H217,spisak!$B$4:$B$542,0)))","v":"Stak Zemun"},1,3,{"$nulls":7},"Pavlović Dimitrije","Miljuš Luka"]
[217,2,"gz",null,null,{"$f":"S204","v":"Varga Danijel"},{"$f":"IF(F218=\"bye\",\"\",INDEX(spisak!$C$4:$C$308,MATCH(F218,spisak!$B$4:$B$542,0)))","v":"Temerin"},{"$f":"S205","v":"Ninković Uroš"},{"$f":"IF(H218=\"bye\",\"\",INDEX(spisak!$C$4:$C$308,MATCH(H218,spisak!$B$4:$B$542,0)))","v":"Stak Zemun"},1,3,{"v":1012,"d":"10-12"},{"v":1106,"d":"11-06"},{"v":811,"d":"08-11"},{"v":511,"d":"05-11"},{"$nulls":3},"Ninković Uroš","Varga Danijel"]
[218,2,"gz",null,null,{"$f":"S206","v":"Paunović Petar"},{"$f":"IF(F219=\"bye\",\"\",INDEX(spisak!$C$4:$C$308,MATCH(F219,spisak!$B$4:$B$542,0)))","v":"Stoni"},{"$f":"S207","v":"Pavlović Dušan"},{"$f":"IF(H219=\"bye\",\"\",INDEX(spisak!$C$4:$C$308,MATCH(H219,spisak!$B$4:$B$542,0)))","v":"Stak Zemun"},0,3,{"v":311,"d":"03-11"},{"v":611,"d":"06-11"},{"v":811,"d":"08-11"},{"$nulls":4},"Pavlović Dušan","Paunović Petar"]
[219,2,"gz",null,null,{"$f":"S208","v":"Stefanović Vanja"},{"$f":"IF(F220=\"bye\",\"\",INDEX(spisak!$C$4:$C$308,MATCH(F220,spisak!$B$4:$B$542,0)))","v":"Stak Zemun"},{"$f":"S209","v":"Radonjić Stefan"},{"$f":"IF(H220=\"bye\",\"\",INDEX(spisak!$C$4:$C$308,MATCH(H220,spisak!$B$4:$B$542,0)))","v":"Milenijum"},3,1,{"v":711,"d":"07-11"},{"v":1105,"d":"11-05"},{"v":1106,"d":"11-06"},{"v":1105,"d":"11-05"},{"$nulls":3},"Stefanović Vanja","Radonjić Stefan"]
[220,2,"gz",null,null,{"$f":"S210","v":"Jozić Marino"},{"$f":"IF(F221=\"bye\",\"\",INDEX(spisak!$C$4:$C$308,MATCH(F221,spisak!$B$4:$B$542,0)))","v":"Spartak"},{"$f":"S211","v":"Jelikić Dimitrije"},{"$f":"IF(H221=\"bye\",\"\",INDEX(spisak!$C$4:$C$308,MATCH(H221,spisak!$B$4:$B$542,0)))","v":"Crvena Zvezda Beograd"},0,3,{"v":311,"d":"03-11"},{"v":711,"d":"07-11"},{"v":711,"d":"07-11"},{"$nulls":4},"Jelikić Dimitrije","Jozić Marino"]
[221,2,"gz",null,null,{"$f":"S212","v":"Bošković Marko"},{"$f":"IF(F222=\"bye\",\"\",INDEX(spisak!$C$4:$C$308,MATCH(F222,spisak!$B$4:$B$542,0)))","v":"Stak Zemun"},{"$f":"S213","v":"Rajić Dalibor"},{"$f":"IF(H222=\"bye\",\"\",INDEX(spisak!$C$4:$C$308,MATCH(H222,spisak!$B$4:$B$542,0)))","v":"Novi Sad"},3,0,{"v":1106,"d":"11-06"},{"v":1108,"d":"11-08"},{"v":1105,"d":"11-05"},{"$nulls":4},"Bošković Marko","Rajić Dalibor"]
[222,2,"gz",null,null,{"$f":"S214","v":"Gerginov Vanja"},{"$f":"IF(F223=\"bye\",\"\",INDEX(spisak!$C$4:$C$308,MATCH(F223,spisak!$B$4:$B$542,0)))","v":"Novi Sad"},{"$f":"S215","v":"Šepa Matija"},{"$f":"IF(H223=\"bye\",\"\",INDEX(spisak!$C$4:$C$308,MATCH(H223,spisak!$B$4:$B$542,0)))","v":"Stak Zemun"},0,3,{"v":711,"d":"07-11"},{"v":111,"d":"01-11"},{"v":511,"d":"05-11"},{"$nulls":4},"Šepa Matija","Gerginov Vanja"]
[223,"QF","gz",null,null,{"$f":"S216","v":"Ilić Bogdan"},{"$f":"IF(F224=\"bye\",\"\",INDEX(spisak!$C$4:$C$308,MATCH(F224,spisak!$B$4:$B$542,0)))","v":"Napad"},{"$f":"S217","v":"Pavlović Dimitrije"},{"$f":"IF(H224=\"bye\",\"\",INDEX(spisak!$C$4:$C$308,MATCH(H224,spisak!$B$4:$B$542,0)))","v":"Stak Zemun"},1,3,{"v":1109,"d":"11-09"},{"v":811,"d":"08-11"},{"v":711,"d":"07-11"},{"v":811,"d":"08-11"},{"$nulls":3},"Pavlović Dimitrije","Ilić Bogdan"]
[224,"QF","gz",null,null,{"$f":"S218","v":"Ninković Uroš"},{"$f":"IF(F225=\"bye\",\"\",INDEX(spisak!$C$4:$C$308,MATCH(F225,spisak!$B$4:$B$542,0)))","v":"Stak Zemun"},{"$f":"S219","v":"Pavlović Dušan"},{"$f":"IF(H225=\"bye\",\"\",INDEX(spisak!$C$4:$C$308,MATCH(H225,spisak!$B$4:$B$542,0)))","v":"Stak Zemun"},0,3,{"v":311,"d":"03-11"},{"v":711,"d":"07-11"},{"v":511,"d":"05-11"},{"$nulls":4},"Pavlović Dušan","Ninković Uroš"]
[225,"QF","gz",null,null,{"$f":"S220","v":"Stefanović Vanja"},{"$f":"IF(F226=\"bye\",\"\",INDEX(spisak!$C$4:$C$308,MATCH(F226,spisak!$B$4:$B$542,0)))","v":"Stak Zemun"},{"$f":"S221","v":"Jelikić Dimitrije"},{"$f":"IF(H226=\"bye\",\"\",INDEX(spisak!$C$4:$C$308,MATCH(H226,spisak!$B$4:$B$542,0)))","v":"Crvena Zvezda Beograd"},2,3,{"v":511,"d":"05-11"},{"v":1107,"d":"11-07"},{"v":1106,"d":"11-06"},{"v":911,"d":"09-11"},{"v":711,"d":"07-11"},null,null,"Jelikić Dimitrije","Stefanović Vanja"]
[226,"QF","gz",null,null,{"$f":"S222","v":"Bošković Marko"},{"$f":"IF(F227=\"bye\",\"\",INDEX(spisak!$C$4:$C$308,MATCH(F227,spisak!$B$4:$B$542,0)))","v":"Stak Zemun"},{"$f":"S223","v":"Šepa Matija"},{"$f":"IF(H227=\"bye\",\"\",INDEX(spisak!$C$4:$C$308,MATCH(H227,spisak!$B$4:$B$542,0)))","v":"Stak Zemun"},2,3,{"v":1109,"d":"11-09"},{"v":611,"d":"06-11"},{"v":811,"d":"08-11"},{"v":1108,"d":"11-08"},{"v":711,"d":"07-11"},null,null,"Šepa Matija","Bošković Marko"]
[227,"SF","gz",null,null,{"$f":"S224","v":"Pavlović Dimitrije"},{"$f":"IF(F228=\"bye\",\"\",INDEX(spisak!$C$4:$C$308,MATCH(F228,spisak!$B$4:$B$542,0)))","v":"Stak Zemun"},{"$f":"S225","v":"Pavlović Dušan"},{"$f":"IF(H228=\"bye\",\"\",INDEX(spisak!$C$4:$C$308,MATCH(H228,spisak!$B$4:$B$542,0)))","v":"Stak Zemun"},0,3,{"v":811,"d":"08-11"},{"v":711,"d":"07-11"},{"v":311,"d":"03-11"},{"$nulls":4},"Pavlović Dušan","Pavlović Dimitrije"]
[228,"SF","gz",null,null,{"$f":"S226","v":"Jelikić Dimitrije"},{"$f":"IF(F229=\"bye\",\"\",INDEX(spisak!$C$4:$C$308,MATCH(F229,spisak!$B$4:$B$542,0)))","v":"Crvena Zvezda Beograd"},{"$f":"S227","v":"Šepa Matija"},{"$f":"IF(H229=\"bye\",\"\",INDEX(spisak!$C$4:$C$308,MATCH(H229,spisak!$B$4:$B$542,0)))","v":"Stak Zemun"},3,0,{"v":1210,"d":"12-10"},{"v":1109,"d":"11-09"},{"v":1210,"d":"12-10"},{"$nulls":4},"Jelikić Dimitrije","Šepa Matija"]
[229,"F","gz",null,null,{"$f":"S228","v":"Pavlović Dušan"},{"$f":"IF(F230=\"bye\",\"\",INDEX(spisak!$C$4:$C$308,MATCH(F230,spisak!$B$4:$B$542,0)))","v":"Stak Zemun"},{"$f":"S229","v":"Jelikić Dimitrije"},{"$f":"IF(H230=\"bye\",\"\",INDEX(spisak!$C$4:$C$308,MATCH(H230,spisak!$B$4:$B$542,0)))","v":"Crvena Zvezda Beograd"},2,3,{"v":1106,"d":"11-06"},{"v":711,"d":"07-11"},{"v":811,"d":"08-11"},{"v":1106,"d":"11-06"},{"v":811,"d":"08-11"},null,null,"Jelikić Dimitrije","Pavlović Dušan"]
[230,1,"gz",null,null,{"$f":"IF(ISBLANK('32'!C68),\"bye\",'32'!C68)","v":"bye"},{"$f":"IF(F231=\"bye\",\"\",INDEX(spisak!$C$4:$C$308,MATCH(F231,spisak!$B$4:$B$542,0)))","v":""},{"$f":"IF(ISBLANK('32'!C69),\"bye\",'32'!C69)","v":"bye"},{"$f":"IF(H231=\"bye\",\"\",INDEX(spisak!$C$4:$C$308,MATCH(H231,spisak!$B$4:$B$542,0)))","v":""},{"$nulls":9},"bye","bye"]
[231,1,"gz",null,null,{"$f":"IF(ISBLANK('32'!C71),\"bye\",'32'!C71)","v":"bye"},{"$f":"IF(F232=\"bye\",\"\",INDEX(spisak!$C$4:$C$308,MATCH(F232,spisak!$B$4:$B$542,0)))","v":""},{"$f":"IF(ISBLANK('32'!C73),\"bye\",'32'!C73)","v":"bye"},{"$f":"IF(H232=\"bye\",\"\",INDEX(spisak!$C$4:$C$308,MATCH(H232,spisak!$B$4:$B$542,0)))","v":""},{"$nulls":9},{"$f":"IF(AND(F232=\"bye\",H232=\"bye\"),\"bye\",IF(F232=\"bye\",H232,IF(H232=\"bye\",F232,IF(ISBLANK(J232),\"bye\",IF(J232>K232,F232,H232)))))","v":"bye"},{"$f":"IF(AND(F232=\"bye\",H232=\"bye\"),\"bye\",IF(F232=\"bye\",H232,IF(H232=\"bye\",F232,IF(ISBLANK(J232),\"bye\",IF(J232>K232,H232,F232)))))","v":"bye"}]
[232,1,"gz",null,null,{"$f":"IF(ISBLANK('32'!C75),\"bye\",'32'!C75)","v":"bye"},{"$f":"IF(F233=\"bye\",\"\",INDEX(spisak!$C$4:$C$308,MATCH(F233,spisak!$B$4:$B$542,0)))","v":""},{"$f":"IF(ISBLANK('32'!C77),\"bye\",'32'!C77)","v":"bye"},{"$f":"IF(H233=\"bye\",\"\",INDEX(spisak!$C$4:$C$308,MATCH(H233,spisak!$B$4:$B$542,0)))","v":""},{"$nulls":9},"bye","bye"]
[233,1,"gz",null,null,{"$f":"IF(ISBLANK('32'!C79),\"bye\",'32'!C79)","v":"bye"},{"$f":"IF(F234=\"bye\",\"\",INDEX(spisak!$C$4:$C$308,MATCH(F234,spisak!$B$4:$B$542,0)))","v":""},{"$f":"IF(ISBLANK('32'!C81),\"bye\",'32'!C81)","v":"bye"},{"$f":"IF(H234=\"bye\",\"\",INDEX(spisak!$C$4:$C$308,MATCH(H234,spisak!$B$4:$B$542,0)))","v":""},{"$nulls":9},"bye","bye"]
[234,1,"gz",null,null,{"$f":"IF(ISBLANK('32'!C83),\"bye\",'32'!C83)","v":"bye"},{"$f":"IF(F235=\"bye\",\"\",INDEX(spisak!$C$4:$C$308,MATCH(F235,spisak!$B$4:$B$542,0)))","v":""},{"$f":"IF(ISBLANK('32'!C85),\"bye\",'32'!C85)","v":"bye"},{"$f":"IF(H235=\"bye\",\"\",INDEX(spisak!$C$4:$C$308,MATCH(H235,spisak!$B$4:$B$542,0)))","v":""},{"$nulls":9},"bye","bye"]
[235,1,"gz",null,null,{"$f":"IF(ISBLANK('32'!C87),\"bye\",'32'!C87)","v":"bye"},{"$f":"IF(F236=\"bye\",\"\",INDEX(spisak!$C$4:$C$308,MATCH(F236,spisak!$B$4:$B$542,0)))","v":""},{"$f":"IF(ISBLANK('32'!C89),\"bye\",'32'!C89)","v":"bye"},{"$f":"IF(H236=\"bye\",\"\",INDEX(spisak!$C$4:$C$308,MATCH(H236,spisak!$B$4:$B$542,0)))","v":""},{"$nulls":9},"bye","bye"]
[236,1,"gz",null,null,{"$f":"IF(ISBLANK('32'!C91),\"bye\",'32'!C91)","v":"bye"},{"$f":"IF(F237=\"bye\",\"\",INDEX(spisak!$C$4:$C$308,MATCH(F237,spisak!$B$4:$B$542,0)))","v":""},{"$f":"IF(ISBLANK('32'!C93),\"bye\",'32'!C93)","v":"bye"},{"$f":"IF(H237=\"bye\",\"\",INDEX(spisak!$C$4:$C$308,MATCH(H237,spisak!$B$4:$B$542,0)))","v":""},{"$nulls":9},"bye","bye"]
[237,1,"gz",null,null,{"$f":"IF(ISBLANK('32'!C95),\"bye\",'32'!C95)","v":"bye"},{"$f":"IF(F238=\"bye\",\"\",INDEX(spisak!$C$4:$C$308,MATCH(F238,spisak!$B$4:$B$542,0)))","v":""},{"$f":"IF(ISBLANK('32'!C97),\"bye\",'32'!C97)","v":"bye"},{"$f":"IF(H238=\"bye\",\"\",INDEX(spisak!$C$4:$C$308,MATCH(H238,spisak!$B$4:$B$542,0)))","v":""},{"$nulls":9},"bye","bye"]
[238,1,"gz",null,null,{"$f":"IF(ISBLANK('32'!C99),\"bye\",'32'!C99)","v":"bye"},{"$f":"IF(F239=\"bye\",\"\",INDEX(spisak!$C$4:$C$308,MATCH(F239,spisak!$B$4:$B$542,0)))","v":""},{"$f":"IF(ISBLANK('32'!C101),\"bye\",'32'!C101)","v":"bye"},{"$f":"IF(H239=\"bye\",\"\",INDEX(spisak!$C$4:$C$308,MATCH(H239,spisak!$B$4:$B$542,0)))","v":""},{"$nulls":9},"bye","bye"]
[239,1,"gz",null,null,{"$f":"IF(ISBLANK('32'!C103),\"bye\",'32'!C103)","v":"bye"},{"$f":"IF(F240=\"bye\",\"\",INDEX(spisak!$C$4:$C$308,MATCH(F240,spisak!$B$4:$B$542,0)))","v":""},{"$f":"IF(ISBLANK('32'!C105),\"bye\",'32'!C105)","v":"bye"},{"$f":"IF(H240=\"bye\",\"\",INDEX(spisak!$C$4:$C$308,MATCH(H240,spisak!$B$4:$B$542,0)))","v":""},{"$nulls":9},"bye","bye"]
[240,1,"gz",null,null,{"$f":"IF(ISBLANK('32'!C107),\"bye\",'32'!C107)","v":"bye"},{"$f":"IF(F241=\"bye\",\"\",INDEX(spisak!$C$4:$C$308,MATCH(F241,spisak!$B$4:$B$542,0)))","v":""},{"$f":"IF(ISBLANK('32'!C109),\"bye\",'32'!C109)","v":"bye"},{"$f":"IF(H241=\"bye\",\"\",INDEX(spisak!$C$4:$C$308,MATCH(H241,spisak!$B$4:$B$542,0)))","v":""},{"$nulls":9},"bye","bye"]
[241,1,"gz",null,null,{"$f":"IF(ISBLANK('32'!C111),\"bye\",'32'!C111)","v":"bye"},{"$f":"IF(F242=\"bye\",\"\",INDEX(spisak!$C$4:$C$308,MATCH(F242,spisak!$B$4:$B$542,0)))","v":""},{"$f":"IF(ISBLANK('32'!C113),\"bye\",'32'!C113)","v":"bye"},{"$f":"IF(H242=\"bye\",\"\",INDEX(spisak!$C$4:$C$308,MATCH(H242,spisak!$B$4:$B$542,0)))","v":""},{"$nulls":9},"bye","bye"]
[242,1,"gz",null,null,{"$f":"IF(ISBLANK('32'!C115),\"bye\",'32'!C115)","v":"bye"},{"$f":"IF(F243=\"bye\",\"\",INDEX(spisak!$C$4:$C$308,MATCH(F243,spisak!$B$4:$B$542,0)))","v":""},{"$f":"IF(ISBLANK('32'!C117),\"bye\",'32'!C117)","v":"bye"},{"$f":"IF(H243=\"bye\",\"\",INDEX(spisak!$C$4:$C$308,MATCH(H243,spisak!$B$4:$B$542,0)))","v":""},{"$nulls":9},"bye","bye"]
[243,1,"gz",null,null,{"$f":"IF(ISBLANK('32'!C119),\"bye\",'32'!C119)","v":"bye"},{"$f":"IF(F244=\"bye\",\"\",INDEX(spisak!$C$4:$C$308,MATCH(F244,spisak!$B$4:$B$542,0)))","v":""},{"$f":"IF(ISBLANK('32'!C121),\"bye\",'32'!C121)","v":"bye"},{"$f":"IF(H244=\"bye\",\"\",INDEX(spisak!$C$4:$C$308,MATCH(H244,spisak!$B$4:$B$542,0)))","v":""},{"$nulls":9},"bye","bye"]
[244,1,"gz",null,null,{"$f":"IF(ISBLANK('32'!C123),\"bye\",'32'!C123)","v":"bye"},{"$f":"IF(F245=\"bye\",\"\",INDEX(spisak!$C$4:$C$308,MATCH(F245,spisak!$B$4:$B$542,0)))","v":""},{"$f":"IF(ISBLANK('32'!C125),\"bye\",'32'!C125)","v":"bye"},{"$f":"IF(H245=\"bye\",\"\",INDEX(spisak!$C$4:$C$308,MATCH(H245,spisak!$B$4:$B$542,0)))","v":""},{"$nulls":9},"bye","bye"]
[245,1,"gz",null,null,{"$f":"IF(ISBLANK('32'!C127),\"bye\",'32'!C127)","v":"bye"},{"$f":"IF(F246=\"bye\",\"\",INDEX(spisak!$C$4:$C$308,MATCH(F246,spisak!$B$4:$B$542,0)))","v":""},{"$f":"IF(ISBLANK('32'!C129),\"bye\",'32'!C129)","v":"bye"},{"$f":"IF(H246=\"bye\",\"\",INDEX(spisak!$C$4:$C$308,MATCH(H246,spisak!$B$4:$B$542,0)))","v":""},{"$nulls":9},"bye","bye"]
[246,2,"gz",null,null,{"$f":"S231","v":"bye"},{"$f":"IF(F247=\"bye\",\"\",INDEX(spisak!$C$4:$C$308,MATCH(F247,spisak!$B$4:$B$542,0)))","v":""},{"$f":"S232","v":"bye"},{"$f":"IF(H247=\"bye\",\"\",INDEX(spisak!$C$4:$C$308,MATCH(H247,spisak!$B$4:$B$542,0)))","v":""},{"$nulls":9},"bye","bye"]
[247,2,"gz",null,null,{"$f":"S233","v":"bye"},{"$f":"IF(F248=\"bye\",\"\",INDEX(spisak!$C$4:$C$308,MATCH(F248,spisak!$B$4:$B$542,0)))","v":""},{"$f":"S234","v":"bye"},{"$f":"IF(H248=\"bye\",\"\",INDEX(spisak!$C$4:$C$308,MATCH(H248,spisak!$B$4:$B$542,0)))","v":""},{"$nulls":9},"bye","bye"]
[248,2,"gz",null,null,{"$f":"S235","v":"bye"},{"$f":"IF(F249=\"bye\",\"\",INDEX(spisak!$C$4:$C$308,MATCH(F249,spisak!$B$4:$B$542,0)))","v":""},{"$f":"S236","v":"bye"},{"$f":"IF(H249=\"bye\",\"\",INDEX(spisak!$C$4:$C$308,MATCH(H249,spisak!$B$4:$B$542,0)))","v":""},{"$nulls":9},"bye","bye"]
[249,2,"gz",null,null,{"$f":"S237","v":"bye"},{"$f":"IF(F250=\"bye\",\"\",INDEX(spisak!$C$4:$C$308,MATCH(F250,spisak!$B$4:$B$542,0)))","v":""},{"$f":"S238","v":"bye"},{"$f":"IF(H250=\"bye\",\"\",INDEX(spisak!$C$4:$C$308,MATCH(H250,spisak!$B$4:$B$542,0)))","v":""},{"$nulls":9},"bye","bye"]
[250,2,"gz",null,null,{"$f":"S239","v":"bye"},{"$f":"IF(F251=\"bye\",\"\",INDEX(spisak!$C$4:$C$308,MATCH(F251,spisak!$B$4:$B$542,0)))","v":""},{"$f":"S240","v":"bye"},{"$f":"IF(H251=\"bye\",\"\",INDEX(spisak!$C$4:$C$308,MATCH(H251,spisak!$B$4:$B$542,0)))","v":""},{"$nulls":9},"bye","bye"]
[251,2,"gz",null,null,{"$f":"S241","v":"bye"},{"$f":"IF(F252=\"bye\",\"\",INDEX(spisak!$C$4:$C$308,MATCH(F252,spisak!$B$4:$B$542,0)))","v":""},{"$f":"S242","v":"bye"},{"$f":"IF(H252=\"bye\",\"\",INDEX(spisak!$C$4:$C$308,MATCH(H252,spisak!$B$4:$B$542,0)))","v":""},{"$nulls":9},"bye","bye"]
[252,2,"gz",null,null,{"$f":"S243","v":"bye"},{"$f":"IF(F253=\"bye\",\"\",INDEX(spisak!$C$4:$C$308,MATCH(F253,spisak!$B$4:$B$542,0)))","v":""},{"$f":"S244","v":"bye"},{"$f":"IF(H253=\"bye\",\"\",INDEX(spisak!$C$4:$C$308,MATCH(H253,spisak!$B$4:$B$542,0)))","v":""},{"$nulls":9},"bye","bye"]
[253,2,"gz",null,null,{"$f":"S245","v":"bye"},{"$f":"IF(F254=\"bye\",\"\",INDEX(spisak!$C$4:$C$308,MATCH(F254,spisak!$B$4:$B$542,0)))","v":""},{"$f":"S246","v":"bye"},{"$f":"IF(H254=\"bye\",\"\",INDEX(spisak!$C$4:$C$308,MATCH(H254,spisak!$B$4:$B$542,0)))","v":""},{"$nulls":9},"bye","bye"]
[254,"QF","gz",null,null,{"$f":"S247","v":"bye"},{"$f":"IF(F255=\"bye\",\"\",INDEX(spisak!$C$4:$C$308,MATCH(F255,spisak!$B$4:$B$542,0)))","v":""},{"$f":"S248","v":"bye"},{"$f":"IF(H255=\"bye\",\"\",INDEX(spisak!$C$4:$C$308,MATCH(H255,spisak!$B$4:$B$542,0)))","v":""},{"$nulls":9},"bye","bye"]
[255,"QF","gz",null,null,{"$f":"S249","v":"bye"},{"$f":"IF(F256=\"bye\",\"\",INDEX(spisak!$C$4:$C$308,MATCH(F256,spisak!$B$4:$B$542,0)))","v":""},{"$f":"S250","v":"bye"},{"$f":"IF(H256=\"bye\",\"\",INDEX(spisak!$C$4:$C$308,MATCH(H256,spisak!$B$4:$B$542,0)))","v":""},{"$nulls":9},"bye","bye"]
[256,"QF","gz",null,null,{"$f":"S251","v":"bye"},{"$f":"IF(F257=\"bye\",\"\",INDEX(spisak!$C$4:$C$308,MATCH(F257,spisak!$B$4:$B$542,0)))","v":""},{"$f":"S252","v":"bye"},{"$f":"IF(H257=\"bye\",\"\",INDEX(spisak!$C$4:$C$308,MATCH(H257,spisak!$B$4:$B$542,0)))","v":""},{"$nulls":9},"bye","bye"]
[257,"QF","gz",null,null,{"$f":"S253","v":"bye"},{"$f":"IF(F258=\"bye\",\"\",INDEX(spisak!$C$4:$C$308,MATCH(F258,spisak!$B$4:$B$542,0)))","v":""},{"$f":"S254","v":"bye"},{"$f":"IF(H258=\"bye\",\"\",INDEX(spisak!$C$4:$C$308,MATCH(H258,spisak!$B$4:$B$542,0)))","v":""},{"$nulls":9},"bye","bye"]
[258,"SF","gz",null,null,{"$f":"S255","v":"bye"},{"$f":"IF(ISNA(MATCH(F259,spisak!$B$4:$B$542,0)),\"***\",INDEX(spisak!$C$4:$C$308,MATCH(F259,spisak!$B$4:$B$542,0)))","v":"***"},{"$f":"S256","v":"bye"},{"$f":"IF(ISNA(MATCH(H259,spisak!$B$4:$B$542,0)),\"***\",INDEX(spisak!$C$4:$C$308,MATCH(H259,spisak!$B$4:$B$542,0)))","v":"***"},{"$nulls":9},"bye","bye"]
[259,"SF","gz",null,null,{"$f":"S257","v":"bye"},{"$f":"IF(ISNA(MATCH(F260,spisak!$B$4:$B$542,0)),\"***\",INDEX(spisak!$C$4:$C$308,MATCH(F260,spisak!$B$4:$B$542,0)))","v":"***"},{"$f":"S258","v":"bye"},{"$f":"IF(ISNA(MATCH(H260,spisak!$B$4:$B$542,0)),\"***\",INDEX(spisak!$C$4:$C$308,MATCH(H260,spisak!$B$4:$B$542,0)))","v":"***"},{"$nulls":9},"bye","bye"]
[260,"F","gz",null,null,{"$f":"S259","v":"bye"},{"$f":"IF(ISNA(MATCH(F261,spisak!$B$4:$B$542,0)),\"***\",INDEX(spisak!$C$4:$C$308,MATCH(F261,spisak!$B$4:$B$542,0)))","v":"***"},{"$f":"S260","v":"bye"},{"$f":"IF(ISNA(MATCH(H261,spisak!$B$4:$B$542,0)),\"***\",INDEX(spisak!$C$4:$C$308,MATCH(H261,spisak!$B$4:$B$542,0)))","v":"***"},{"$nulls":9},"bye","bye"]
[262,{"$nulls":4},{"$f":"S230","v":"Jelikić Dimitrije"},{"$f":"IF(ISNA(MATCH(F262,spisak!$B$4:$B$542,0)),\"***\",INDEX(spisak!$C$4:$C$308,MATCH(F262,spisak!$B$4:$B$542,0)))","v":"Crvena Zvezda Beograd"},{"$f":"S261","v":"bye"},{"$f":"IF(ISNA(MATCH(H262,spisak!$B$4:$B$542,0)),\"***\",INDEX(spisak!$C$4:$C$308,MATCH(H262,spisak!$B$4:$B$542,0)))","v":"***"},{"$nulls":9},"Jelikić Dimitrije","Jelikić Dimitrije"]
[231,1,"r1",null,null,{"$f":"IF(ISBLANK(J200),\"bye\",IF(J200<K201,F200,H200))","v":"Putnik Dario"},null,{"$f":"IF(ISBLANK(J201),\"bye\",IF(J201<K201,F201,H201))","v":"Rajić Borislav"},{"$nulls":10},{"$f":"IF(ISBLANK(J263),\"\",IF(J263>K263,F263,H263))","v":""},{"$f":"IF(AND(F263=\"***\",H263=\"***\"),\"***\",IF(F263=\"***\",H263,IF(H263=\"***\",F263,IF(ISBLANK(J263),\"\",IF(J263>K263,H263,F263)))))","v":""}]
[232,1,"r1",null,null,{"$f":"IF(ISBLANK(J202),\"bye\",IF(J202<K202,F202,H202))","v":"Stefanović Luka"},null,{"$f":"IF(ISBLANK(J203),\"bye\",IF(J203<K203,F203,H203))","v":"Vasić Bogdan"},{"$nulls":10},"",""]
[233,1,"r1",null,null,{"$f":"IF(ISBLANK(J204),\"bye\",IF(J204<K204,F204,H204))","v":"Marković Jovan"},null,{"$f":"IF(ISBLANK(J205),\"bye\",IF(J205<K205,F205,H205))","v":"Kalinčević Vladimir"},{"$nulls":10},"",""]
[234,1,"r1",null,null,{"$f":"IF(ISBLANK(J206),\"bye\",IF(J206<K206,F206,H206))","v":"Mladenović Ognjen"},null,{"$f":"IF(ISBLANK(J207),\"bye\",IF(J207<K207,F207,H207))","v":"Velinović Miloš"},{"$nulls":10},"",""]
[235,1,"r1",null,null,{"$f":"IF(ISBLANK(J208),\"bye\",IF(J208<K208,F208,H208))","v":"Preslav Nikolov"},null,{"$f":"IF(ISBLANK(J209),\"bye\",IF(J209<K209,F209,H209))","v":"Dragin Saša"},{"$nulls":10},"",""]
[236,1,"r1",null,null,{"$f":"IF(ISBLANK(J210),\"bye\",IF(J210<K210,F210,H210))","v":"Zaharijev  Nikola"},null,{"$f":"IF(ISBLANK(J211),\"bye\",IF(J211<K211,F211,H211))","v":"Jovanović Đurađ"},{"$nulls":10},"",""]
[237,1,"r1",null,null,{"$f":"IF(ISBLANK(J212),\"bye\",IF(J212<K212,F212,H212))","v":"Pucarević Pavle"},null,{"$f":"IF(ISBLANK(J213),\"bye\",IF(J213<K213,F213,H213))","v":"Marinković Vasilije"},{"$nulls":10},"",""]
[238,1,"r1",null,null,{"$f":"IF(ISBLANK(J214),\"bye\",IF(J214<K214,F214,H214))","v":"Konstantinov Marko"},null,{"$f":"IF(ISBLANK(J215),\"bye\",IF(J215<K215,F215,H215))","v":"Miovčić Mihailo"},{"$nulls":10},"",""]
[239,1,"r3",null,null,{"$f":"IF(ISBLANK(J216),\"bye\",IF(J216<K216,F216,H216))","v":"Pavković Đorđe"},null,{"$f":"IF(ISBLANK(J217),\"bye\",IF(J217<K217,F217,H217))","v":"Miljuš Luka"},{"$nulls":10},"",""]
[240,1,"r3",null,null,{"$f":"IF(ISBLANK(J218),\"bye\",IF(J218<K218,F218,H218))","v":"Varga Danijel"},null,{"$f":"IF(ISBLANK(J219),\"bye\",IF(J219<K219,F219,H219))","v":"Paunović Petar"},{"$nulls":10},"",""]
[241,1,"r3",null,null,{"$f":"IF(ISBLANK(J220),\"bye\",IF(J220<K220,F220,H220))","v":"Radonjić Stefan"},null,{"$f":"IF(ISBLANK(J221),\"bye\",IF(J221<K221,F221,H221))","v":"Jozić Marino"},{"$nulls":10},"",""]
[242,1,"r3",null,null,{"$f":"IF(ISBLANK(J222),\"bye\",IF(J222<K222,F222,H222))","v":"Rajić Dalibor"},null,{"$f":"IF(ISBLANK(J223),\"bye\",IF(J223<K223,F223,H223))","v":"Gerginov Vanja"},{"$nulls":10},"",""]
[243,2,"r1",null,null,{"$f":"IF(ISBLANK(J263),\"bye\",IF(J263>K263,F263,H263))","v":"bye"},null,{"$f":"IF(ISBLANK(J264),\"bye\",IF(J264>K264,F264,H264))","v":"bye"},{"$nulls":10},"",""]
[244,2,"r1",null,null,{"$f":"IF(ISBLANK(J265),\"bye\",IF(J265>K265,F265,H265))","v":"bye"},null,{"$f":"IF(ISBLANK(J266),\"bye\",IF(J266>K266,F266,H266))","v":"bye"},{"$nulls":10},"",""]
[245,2,"r1",null,null,{"$f":"IF(ISBLANK(J267),\"bye\",IF(J267>K267,F267,H267))","v":"bye"},null,{"$f":"IF(ISBLANK(J268),\"bye\",IF(J268>K268,F268,H268))","v":"bye"},{"$nulls":10},"",""]
[246,2,"r1",null,null,{"$f":"IF(ISBLANK(J269),\"bye\",IF(J269>K269,F269,H269))","v":"bye"},null,{"$f":"IF(ISBLANK(J270),\"bye\",IF(J270>K270,F270,H270))","v":"bye"},{"$nulls":10},"",""]
[247,1,"r2",null,null,{"$f":"IF(ISBLANK(J263),\"bye\",IF(J263<K263,F263,H263))","v":"bye"},null,{"$f":"IF(ISBLANK(J264),\"bye\",IF(J264<K264,F264,H264))","v":"bye"},{"$nulls":10},"",""]
[248,1,"r2",null,null,{"$f":"IF(ISBLANK(J265),\"bye\",IF(J265<K265,F265,H265))","v":"bye"},null,{"$f":"IF(ISBLANK(J266),\"bye\",IF(J266<K266,F266,H266))","v":"bye"},{"$nulls":10},"",""]
[249,1,"r2",null,null,{"$f":"IF(ISBLANK(J267),\"bye\",IF(J267<K267,F267,H267))","v":"bye"},null,{"$f":"IF(ISBLANK(J268),\"bye\",IF(J268<K268,F268,H268))","v":"bye"},{"$nulls":10},"",""]
[250,1,"r2",null,null,{"$f":"IF(ISBLANK(J269),\"bye\",IF(J269<K269,F269,H269))","v":"bye"},null,{"$f":"IF(ISBLANK(J270),\"bye\",IF(J270<K270,F270,H270))","v":"bye"},{"$nulls":10},"",""]
[{"$nulls":19},""]
[{"$nulls":19},""]

{"sheet":"plasman-bodovi","index":6,"n_rows":75,"n_cols":14,"rows_kept":75,"hidden":true,"merged":[[17,0,17,1],[18,0,19,0]]}
["A","B","C","D","E","PS","plasman","TOP ",{"$f":"info!C3","v":"Otvoreno prvenstvo RSTSN"},{"$nulls":4},{"$f":"info!C4","v":"mlađi kadeti"}]
[210,160,140,120,100,250,"1",230]
[180,140,120,100,80,220,"2",200]
[150,120,100,80,60,190,"3-4",180,"broj igrača",{"$f":"COUNT(spisak!A4:A311)","v":48}]
[120,100,80,60,40,160,"5-8",170,"rang 8 najboljih igrača",{"$f":"SUM(SMALL(spisak!D4:D64,{1;2;3;4;5;6;7;8}))","v":0}]
[100,80,60,40,20,140,"9-16",165,"rang turnira",{"$f":"IF(AND(J5>=36,J5<=45),\"B\",IF(AND(J5>=46,J5<=55),\"C\",IF(AND(J5>=56,J5<=65),\"D\",IF(J5>65,\"E\",\"A\"))))","v":"A"}]
[70,60,40,20,10,110,"17-32",160]
[40,30,20,10,5,80,"33-64",155]
[15,10,8,4,2,20,"PUG",150,"glavni žreb"]
[8,6,4,2,1,10,"U",145,"plasman:","ime i prezime","osvojeni bodovi","plasman:","ime i prezime","osvojeni bodovi"]
[{"$nulls":7},140,"1",{"$f":"partije!S262","v":"Jelikić Dimitrije"},{"$f":"INDEX(INDIRECT($J$6&\"2\"):INDIRECT($J$6&\"10\"),MATCH(I11,$G$2:$G$10,0))","v":210},"33-64",null,{"$f":"INDEX(INDIRECT($J$6&\"2\"):INDIRECT($J$6&\"10\"),MATCH(L11,$G$2:$G$10,0))","v":40}]
[{"$nulls":7},135,"2",{"$f":"partije!T262","v":"Jelikić Dimitrije"},{"$f":"INDEX(INDIRECT($J$6&\"2\"):INDIRECT($J$6&\"10\"),MATCH(I12,$G$2:$G$10,0))","v":180},"33-64",{"$f":"partije!T201","v":"Rajić Borislav"},{"$f":"INDEX(INDIRECT($J$6&\"2\"):INDIRECT($J$6&\"10\"),MATCH(L12,$G$2:$G$10,0))","v":40}]
[{"$nulls":7},130,"3-4",{"$f":"partije!T230","v":"Pavlović Dušan"},{"$f":"INDEX(INDIRECT($J$6&\"2\"):INDIRECT($J$6&\"10\"),MATCH(I13,$G$2:$G$10,0))","v":150},"33-64",{"$f":"partije!T202","v":"Stefanović Luka"},{"$f":"INDEX(INDIRECT($J$6&\"2\"):INDIRECT($J$6&\"10\"),MATCH(L13,$G$2:$G$10,0))","v":40}]
[{"$nulls":8},"3-4",{"$f":"partije!T261","v":"bye"},{"$f":"INDEX(INDIRECT($J$6&\"2\"):INDIRECT($J$6&\"10\"),MATCH(I14,$G$2:$G$10,0))","v":150},"33-64",{"$f":"partije!T203","v":"Vasić Bogdan"},{"$f":"INDEX(INDIRECT($J$6&\"2\"):INDIRECT($J$6&\"10\"),MATCH(L14,$G$2:$G$10,0))","v":40}]
[{"$nulls":8},"5-8",{"$f":"partije!T228","v":"Pavlović Dimitrije"},{"$f":"INDEX(INDIRECT($J$6&\"2\"):INDIRECT($J$6&\"10\"),MATCH(I15,$G$2:$G$10,0))","v":120},"33-64",null,{"$f":"INDEX(INDIRECT($J$6&\"2\"):INDIRECT($J$6&\"10\"),MATCH(L15,$G$2:$G$10,0))","v":40}]
[{"$nulls":8},"5-8",{"$f":"partije!T229","v":"Šepa Matija"},{"$f":"INDEX(INDIRECT($J$6&\"2\"):INDIRECT($J$6&\"10\"),MATCH(I16,$G$2:$G$10,0))","v":120},"33-64",{"$f":"partije!T205","v":"Kalinčević Vladimir"},{"$f":"INDEX(INDIRECT($J$6&\"2\"):INDIRECT($J$6&\"10\"),MATCH(L16,$G$2:$G$10,0))","v":40}]
[{"$nulls":8},"5-8",{"$f":"partije!T259","v":"bye"},{"$f":"INDEX(INDIRECT($J$6&\"2\"):INDIRECT($J$6&\"10\"),MATCH(I17,$G$2:$G$10,0))","v":120},"33-64",{"$f":"partije!T206","v":"Mladenović Ognjen"},{"$f":"INDEX(INDIRECT($J$6&\"2\"):INDIRECT($J$6&\"10\"),MATCH(L17,$G$2:$G$10,0))","v":40}]
["rejting turnira",{"$nulls":7},"5-8",{"$f":"partije!T260","v":"bye"},{"$f":"INDEX(INDIRECT($J$6&\"2\"):INDIRECT($J$6&\"10\"),MATCH(I18,$G$2:$G$10,0))","v":120},"33-64",null,{"$f":"INDEX(INDIRECT($J$6&\"2\"):INDIRECT($J$6&\"10\"),MATCH(L18,$G$2:$G$10,0))","v":40}]
["rejting","zbir bodova",{"$nulls":6},"9-16",{"$f":"partije!T224","v":"Ilić Bogdan"},{"$f":"INDEX(INDIRECT($J$6&\"2\"):INDIRECT($J$6&\"10\"),MATCH(I19,$G$2:$G$10,0))","v":100},"33-64",null,{"$f":"INDEX(INDIRECT($J$6&\"2\"):INDIRECT($J$6&\"10\"),MATCH(L19,$G$2:$G$10,0))","v":40}]
[null,"najboljih 8 igrača",{"$nulls":6},"9-16",{"$f":"partije!T225","v":"Ninković Uroš"},{"$f":"INDEX(INDIRECT($J$6&\"2\"):INDIRECT($J$6&\"10\"),MATCH(I20,$G$2:$G$10,0))","v":100},"33-64",{"$f":"partije!T209","v":"Dragin Saša"},{"$f":"INDEX(INDIRECT($J$6&\"2\"):INDIRECT($J$6&\"10\"),MATCH(L20,$G$2:$G$10,0))","v":40}]
["B","36-45",{"$nulls":6},"9-16",{"$f":"partije!T226","v":"Stefanović Vanja"},{"$f":"INDEX(INDIRECT($J$6&\"2\"):INDIRECT($J$6&\"10\"),MATCH(I21,$G$2:$G$10,0))","v":100},"33-64",{"$f":"partije!T210","v":"Zaharijev  Nikola"},{"$f":"INDEX(INDIRECT($J$6&\"2\"):INDIRECT($J$6&\"10\"),MATCH(L21,$G$2:$G$10,0))","v":40}]
["C","46-55",{"$nulls":6},"9-16",{"$f":"partije!T227","v":"Bošković Marko"},{"$f":"INDEX(INDIRECT($J$6&\"2\"):INDIRECT($J$6&\"10\"),MATCH(I22,$G$2:$G$10,0))","v":100},"33-64",null,{"$f":"INDEX(INDIRECT($J$6&\"2\"):INDIRECT($J$6&\"10\"),MATCH(L22,$G$2:$G$10,0))","v":40}]
["D","56-65",{"$nulls":6},"9-16",{"$f":"partije!T255","v":"bye"},{"$f":"INDEX(INDIRECT($J$6&\"2\"):INDIRECT($J$6&\"10\"),MATCH(I23,$G$2:$G$10,0))","v":100},"33-64",{"$f":"partije!T212","v":"Pucarević Pavle"},{"$f":"INDEX(INDIRECT($J$6&\"2\"):INDIRECT($J$6&\"10\"),MATCH(L23,$G$2:$G$10,0))","v":40}]
["E",">65",{"$nulls":6},"9-16",{"$f":"partije!T256","v":"bye"},{"$f":"INDEX(INDIRECT($J$6&\"2\"):INDIRECT($J$6&\"10\"),MATCH(I24,$G$2:$G$10,0))","v":100},"33-64",{"$f":"partije!T213","v":"Marinković Vasilije"},{"$f":"INDEX(INDIRECT($J$6&\"2\"):INDIRECT($J$6&\"10\"),MATCH(L24,$G$2:$G$10,0))","v":40}]
[{"$nulls":8},"9-16",{"$f":"partije!T257","v":"bye"},{"$f":"INDEX(INDIRECT($J$6&\"2\"):INDIRECT($J$6&\"10\"),MATCH(I25,$G$2:$G$10,0))","v":100},"33-64",{"$f":"partije!T214","v":"Konstantinov Marko"},{"$f":"INDEX(INDIRECT($J$6&\"2\"):INDIRECT($J$6&\"10\"),MATCH(L25,$G$2:$G$10,0))","v":40}]
[{"$nulls":8},"9-16",{"$f":"partije!T258","v":"bye"},{"$f":"INDEX(INDIRECT($J$6&\"2\"):INDIRECT($J$6&\"10\"),MATCH(I26,$G$2:$G$10,0))","v":100},"33-64",null,{"$f":"INDEX(INDIRECT($J$6&\"2\"):INDIRECT($J$6&\"10\"),MATCH(L26,$G$2:$G$10,0))","v":40}]
[{"$nulls":8},"17-32",{"$f":"partije!T216","v":"Pavković Đorđe"},{"$f":"INDEX(INDIRECT($J$6&\"2\"):INDIRECT($J$6&\"10\"),MATCH(I27,$G$2:$G$10,0))","v":70},"33-64",null,{"$f":"INDEX(INDIRECT($J$6&\"2\"):INDIRECT($J$6&\"10\"),MATCH(L27,$G$2:$G$10,0))","v":40}]
[{"$nulls":8},"17-32",{"$f":"partije!T217","v":"Miljuš Luka"},{"$f":"INDEX(INDIRECT($J$6&\"2\"):INDIRECT($J$6&\"10\"),MATCH(I28,$G$2:$G$10,0))","v":70},"33-64",{"$f":"partije!T232","v":"bye"},{"$f":"INDEX(INDIRECT($J$6&\"2\"):INDIRECT($J$6&\"10\"),MATCH(L28,$G$2:$G$10,0))","v":40}]
[{"$nulls":8},"17-32",{"$f":"partije!T218","v":"Varga Danijel"},{"$f":"INDEX(INDIRECT($J$6&\"2\"):INDIRECT($J$6&\"10\"),MATCH(I29,$G$2:$G$10,0))","v":70},"33-64",{"$f":"partije!T233","v":"bye"},{"$f":"INDEX(INDIRECT($J$6&\"2\"):INDIRECT($J$6&\"10\"),MATCH(L29,$G$2:$G$10,0))","v":40}]
[{"$nulls":8},"17-32",{"$f":"partije!T219","v":"Paunović Petar"},{"$f":"INDEX(INDIRECT($J$6&\"2\"):INDIRECT($J$6&\"10\"),MATCH(I30,$G$2:$G$10,0))","v":70},"33-64",{"$f":"partije!T234","v":"bye"},{"$f":"INDEX(INDIRECT($J$6&\"2\"):INDIRECT($J$6&\"10\"),MATCH(L30,$G$2:$G$10,0))","v":40}]
[{"$nulls":8},"17-32",{"$f":"partije!T220","v":"Radonjić Stefan"},{"$f":"INDEX(INDIRECT($J$6&\"2\"):INDIRECT($J$6&\"10\"),MATCH(I31,$G$2:$G$10,0))","v":70},"33-64",null,{"$f":"INDEX(INDIRECT($J$6&\"2\"):INDIRECT($J$6&\"10\"),MATCH(L31,$G$2:$G$10,0))","v":40}]
[{"$nulls":8},"17-32",{"$f":"partije!T221","v":"Jozić Marino"},{"$f":"INDEX(INDIRECT($J$6&\"2\"):INDIRECT($J$6&\"10\"),MATCH(I32,$G$2:$G$10,0))","v":70},"33-64",{"$f":"partije!T236","v":"bye"},{"$f":"INDEX(INDIRECT($J$6&\"2\"):INDIRECT($J$6&\"10\"),MATCH(L32,$G$2:$G$10,0))","v":40}]
[{"$nulls":8},"17-32",{"$f":"partije!T222","v":"Rajić Dalibor"},{"$f":"INDEX(INDIRECT($J$6&\"2\"):INDIRECT($J$6&\"10\"),MATCH(I33,$G$2:$G$10,0))","v":70},"33-64",{"$f":"partije!T237","v":"bye"},{"$f":"INDEX(INDIRECT($J$6&\"2\"):INDIRECT($J$6&\"10\"),MATCH(L33,$G$2:$G$10,0))","v":40}]
[{"$nulls":8},"17-32",{"$f":"partije!T223","v":"Gerginov Vanja"},{"$f":"INDEX(INDIRECT($J$6&\"2\"):INDIRECT($J$6&\"10\"),MATCH(I34,$G$2:$G$10,0))","v":70},"33-64",null,{"$f":"INDEX(INDIRECT($J$6&\"2\"):INDIRECT($J$6&\"10\"),MATCH(L34,$G$2:$G$10,0))","v":40}]
[{"$nulls":8},"17-32",{"$f":"partije!T247","v":"bye"},{"$f":"INDEX(INDIRECT($J$6&\"2\"):INDIRECT($J$6&\"10\"),MATCH(I35,$G$2:$G$10,0))","v":70},"33-64",null,{"$f":"INDEX(INDIRECT($J$6&\"2\"):INDIRECT($J$6&\"10\"),MATCH(L35,$G$2:$G$10,0))","v":40}]
[{"$nulls":8},"17-32",{"$f":"partije!T248","v":"bye"},{"$f":"INDEX(INDIRECT($J$6&\"2\"):INDIRECT($J$6&\"10\"),MATCH(I36,$G$2:$G$10,0))","v":70},"33-64",{"$f":"partije!T240","v":"bye"},{"$f":"INDEX(INDIRECT($J$6&\"2\"):INDIRECT($J$6&\"10\"),MATCH(L36,$G$2:$G$10,0))","v":40}]
[{"$nulls":8},"17-32",{"$f":"partije!T249","v":"bye"},{"$f":"INDEX(INDIRECT($J$6&\"2\"):INDIRECT($J$6&\"10\"),MATCH(I37,$G$2:$G$10,0))","v":70},"33-64",{"$f":"partije!T241","v":"bye"},{"$f":"INDEX(INDIRECT($J$6&\"2\"):INDIRECT($J$6&\"10\"),MATCH(L37,$G$2:$G$10,0))","v":40}]
[{"$nulls":8},"17-32",{"$f":"partije!T250","v":"bye"},{"$f":"INDEX(INDIRECT($J$6&\"2\"):INDIRECT($J$6&\"10\"),MATCH(I38,$G$2:$G$10,0))","v":70},"33-64",null,{"$f":"INDEX(INDIRECT($J$6&\"2\"):INDIRECT($J$6&\"10\"),MATCH(L38,$G$2:$G$10,0))","v":40}]
[{"$nulls":8},"17-32",{"$f":"partije!T251","v":"bye"},{"$f":"INDEX(INDIRECT($J$6&\"2\"):INDIRECT($J$6&\"10\"),MATCH(I39,$G$2:$G$10,0))","v":70},"33-64",{"$f":"partije!T243","v":"bye"},{"$f":"INDEX(INDIRECT($J$6&\"2\"):INDIRECT($J$6&\"10\"),MATCH(L39,$G$2:$G$10,0))","v":40}]
[{"$nulls":8},"17-32",{"$f":"partije!T252","v":"bye"},{"$f":"INDEX(INDIRECT($J$6&\"2\"):INDIRECT($J$6&\"10\"),MATCH(I40,$G$2:$G$10,0))","v":70},"33-64",{"$f":"partije!T244","v":"bye"},{"$f":"INDEX(INDIRECT($J$6&\"2\"):INDIRECT($J$6&\"10\"),MATCH(L40,$G$2:$G$10,0))","v":40}]
[{"$nulls":8},"17-32",{"$f":"partije!T253","v":"bye"},{"$f":"INDEX(INDIRECT($J$6&\"2\"):INDIRECT($J$6&\"10\"),MATCH(I41,$G$2:$G$10,0))","v":70},"33-64",{"$f":"partije!T245","v":"bye"},{"$f":"INDEX(INDIRECT($J$6&\"2\"):INDIRECT($J$6&\"10\"),MATCH(L41,$G$2:$G$10,0))","v":40}]
[{"$nulls":8},"17-32",{"$f":"partije!T254","v":"bye"},{"$f":"INDEX(INDIRECT($J$6&\"2\"):INDIRECT($J$6&\"10\"),MATCH(I42,$G$2:$G$10,0))","v":70},"33-64",null,{"$f":"INDEX(INDIRECT($J$6&\"2\"):INDIRECT($J$6&\"10\"),MATCH(L42,$G$2:$G$10,0))","v":40}]
[]
[{"$nulls":8},"kvalifikacije"]
[{"$nulls":8},"3. mesto u grupi","broj pobeda","bodovi","4. mesto u grupi","broj pobeda","bodovi"]
[{"$nulls":8},{"$f":"plasman!#REF!","v":{"$error":"#REF!"}},null,{"$f":"IF(J46=0,\"8\",INDIRECT($J$6&\"9\")*J46)","v":"8"},{"$f":"plasman!#REF!","v":{"$error":"#REF!"}},{"$f":"IF(ISERROR(L46),\"\",COUNTIF(partije!$S$2:$S$199,L46))","v":""},{"$f":"IF(ISERROR(L46),\"\",IF(M46=0,\"8\",INDIRECT($J$6&\"9\")*M46))","v":""}]
[{"$nulls":8},{"$f":"plasman!#REF!","v":{"$error":"#REF!"}},{"$f":"IF(ISERROR(L47),\"\",COUNTIF(partije!$S$2:$S$199,I47))","v":""},{"$f":"IF(J47=0,\"8\",INDIRECT($J$6&\"9\")*J47)","v":{"$error":"#VALUE!"}},{"$f":"plasman!#REF!","v":{"$error":"#REF!"}},{"$f":"IF(ISERROR(L47),\"\",COUNTIF(partije!$S$2:$S$199,L47))","v":""},{"$f":"IF(ISERROR(L47),\"\",IF(M47=0,\"8\",INDIRECT($J$6&\"9\")*M47))","v":""}]
[{"$nulls":8},{"$f":"plasman!#REF!","v":{"$error":"#REF!"}},{"$f":"IF(ISERROR(L48),\"\",COUNTIF(partije!$S$2:$S$199,I48))","v":""},{"$error":"#VALUE!"},{"$f":"plasman!#REF!","v":{"$error":"#REF!"}},{"$f":"IF(ISERROR(L48),\"\",COUNTIF(partije!$S$2:$S$199,L48))","v":""},""]
[{"$nulls":8},{"$f":"plasman!#REF!","v":{"$error":"#REF!"}},{"$f":"IF(ISERROR(L49),\"\",COUNTIF(partije!$S$2:$S$199,I49))","v":0},"8"]
[{"$nulls":8},{"$f":"plasman!#REF!","v":{"$error":"#REF!"}},{"$f":"IF(ISERROR(L50),\"\",COUNTIF(partije!$S$2:$S$199,I50))","v":""},{"$error":"#VALUE!"},{"$f":"plasman!#REF!","v":{"$error":"#REF!"}},{"$f":"IF(ISERROR(L50),\"\",COUNTIF(partije!$S$2:$S$199,L50))","v":""},""]
[{"$nulls":8},{"$f":"plasman!#REF!","v":{"$error":"#REF!"}},{"$f":"IF(ISERROR(L51),\"\",COUNTIF(partije!$S$2:$S$199,I51))","v":""},{"$error":"#VALUE!"},{"$f":"plasman!#REF!","v":{"$error":"#REF!"}},{"$f":"IF(ISERROR(L51),\"\",COUNTIF(partije!$S$2:$S$199,L51))","v":""},""]
[{"$nulls":8},{"$f":"plasman!#REF!","v":{"$error":"#REF!"}},{"$f":"IF(ISERROR(L52),\"\",COUNTIF(partije!$S$2:$S$199,I52))","v":""},{"$error":"#VALUE!"},{"$f":"plasman!#REF!","v":{"$error":"#REF!"}},{"$f":"IF(ISERROR(L52),\"\",COUNTIF(partije!$S$2:$S$199,L52))","v":""},""]
[{"$nulls":8},{"$f":"plasman!#REF!","v":{"$error":"#REF!"}},{"$f":"IF(ISERROR(L53),\"\",COUNTIF(partije!$S$2:$S$199,I53))","v":""},{"$error":"#VALUE!"},{"$f":"plasman!#REF!","v":{"$error":"#REF!"}},{"$f":"IF(ISERROR(L53),\"\",COUNTIF(partije!$S$2:$S$199,L53))","v":""},""]
[{"$nulls":8},{"$f":"plasman!#REF!","v":{"$error":"#REF!"}},{"$f":"IF(ISERROR(L54),\"\",COUNTIF(partije!$S$2:$S$199,I54))","v":""},{"$error":"#VALUE!"},{"$f":"plasman!#REF!","v":{"$error":"#REF!"}},{"$f":"IF(ISERROR(L54),\"\",COUNTIF(partije!$S$2:$S$199,L54))","v":""},""]
[{"$nulls":8},{"$f":"plasman!#REF!","v":{"$error":"#REF!"}},{"$f":"IF(ISERROR(L55),\"\",COUNTIF(partije!$S$2:$S$199,I55))","v":""},{"$error":"#VALUE!"},{"$f":"plasman!#REF!","v":{"$error":"#REF!"}},{"$f":"IF(ISERROR(L55),\"\",COUNTIF(partije!$S$2:$S$199,L55))","v":""},""]
[{"$nulls":8},{"$f":"plasman!#REF!","v":{"$error":"#REF!"}},{"$f":"IF(ISERROR(L56),\"\",COUNTIF(partije!$S$2:$S$199,I56))","v":""},{"$error":"#VALUE!"},{"$f":"plasman!#REF!","v":{"$error":"#REF!"}},{"$f":"IF(ISERROR(L56),\"\",COUNTIF(partije!$S$2:$S$199,L56))","v":""},""]
[{"$nulls":8},{"$f":"plasman!#REF!","v":{"$error":"#REF!"}},{"$f":"IF(ISERROR(L57),\"\",COUNTIF(partije!$S$2:$S$199,I57))","v":""},{"$error":"#VALUE!"},{"$f":"plasman!#REF!","v":{"$error":"#REF!"}},{"$f":"IF(ISERROR(L57),\"\",COUNTIF(partije!$S$2:$S$199,L57))","v":""},""]
[{"$nulls":8},{"$f":"plasman!#REF!","v":{"$error":"#REF!"}},{"$f":"IF(ISERROR(L58),\"\",COUNTIF(partije!$S$2:$S$199,I58))","v":0},"8"]
[{"$nulls":8},{"$f":"plasman!#REF!","v":{"$error":"#REF!"}},{"$f":"IF(ISERROR(L59),\"\",COUNTIF(partije!$S$2:$S$199,I59))","v":""},{"$error":"#VALUE!"},{"$f":"plasman!#REF!","v":{"$error":"#REF!"}},{"$f":"IF(ISERROR(L59),\"\",COUNTIF(partije!$S$2:$S$199,L59))","v":""},""]
[{"$nulls":8},{"$f":"plasman!#REF!","v":{"$error":"#REF!"}},{"$f":"IF(ISERROR(L60),\"\",COUNTIF(partije!$S$2:$S$199,I60))","v":""},{"$error":"#VALUE!"},{"$f":"plasman!#REF!","v":{"$error":"#REF!"}},{"$f":"IF(ISERROR(L60),\"\",COUNTIF(partije!$S$2:$S$199,L60))","v":""},""]
[{"$nulls":8},{"$f":"plasman!#REF!","v":{"$error":"#REF!"}},{"$f":"IF(ISERROR(L61),\"\",COUNTIF(partije!$S$2:$S$199,I61))","v":""},{"$error":"#VALUE!"},{"$f":"plasman!#REF!","v":{"$error":"#REF!"}},{"$f":"IF(ISERROR(L61),\"\",COUNTIF(partije!$S$2:$S$199,L61))","v":""},{"$f":"IF(ISERROR(L61),\"\",IF(M61=0,\"8\",INDIRECT($J$6&\"9\")*M61))","v":""}]
[{"$nulls":11},{"$f":"plasman!#REF!","v":{"$error":"#REF!"}},{"$f":"IF(ISERROR(L62),\"\",COUNTIF(partije!$S$2:$S$199,L62))","v":""},{"$f":"IF(ISERROR(L62),\"\",INDIRECT($J$6&\"9\"))","v":""}]
[{"$nulls":8},{"$f":"plasman!#REF!","v":{"$error":"#REF!"}},{"$f":"IF(ISERROR(L63),\"\",COUNTIF(partije!$S$2:$S$500,I63))","v":""},{"$error":"#VALUE!"},{"$f":"plasman!#REF!","v":{"$error":"#REF!"}},1,""]
[{"$nulls":8},{"$f":"plasman!#REF!","v":{"$error":"#REF!"}},{"$f":"IF(ISERROR(L64),\"\",COUNTIF(partije!$S$2:$S$199,I64))","v":""},{"$f":"INDIRECT($J$6&\"8\")*J64","v":{"$error":"#VALUE!"}},{"$f":"plasman!#REF!","v":{"$error":"#REF!"}},{"$f":"IF(ISERROR(L64),\"\",COUNTIF(partije!$S$2:$S$199,L64))","v":""},""]
[{"$nulls":8},{"$f":"plasman!#REF!","v":{"$error":"#REF!"}},{"$f":"IF(ISERROR(L65),\"\",COUNTIF(partije!$S$2:$S$199,I65))","v":""},{"$error":"#VALUE!"},{"$f":"plasman!#REF!","v":{"$error":"#REF!"}},{"$f":"IF(ISERROR(L65),\"\",COUNTIF(partije!$S$2:$S$199,L65))","v":""},""]
[{"$nulls":8},{"$f":"plasman!#REF!","v":{"$error":"#REF!"}},{"$f":"IF(ISERROR(L66),\"\",COUNTIF(partije!$S$2:$S$199,I66))","v":""},{"$error":"#VALUE!"},{"$f":"plasman!#REF!","v":{"$error":"#REF!"}},{"$f":"IF(ISERROR(L66),\"\",COUNTIF(partije!$S$2:$S$199,L66))","v":""},""]
[{"$nulls":8},{"$f":"plasman!#REF!","v":{"$error":"#REF!"}},{"$f":"IF(ISERROR(L67),\"\",COUNTIF(partije!$S$2:$S$199,I67))","v":""},{"$error":"#VALUE!"},{"$f":"plasman!#REF!","v":{"$error":"#REF!"}},{"$f":"IF(ISERROR(L67),\"\",COUNTIF(partije!$S$2:$S$199,L67))","v":""},""]
[{"$nulls":8},{"$f":"plasman!#REF!","v":{"$error":"#REF!"}},{"$f":"IF(ISERROR(L68),\"\",COUNTIF(partije!$S$2:$S$199,I68))","v":""},{"$error":"#VALUE!"},{"$f":"plasman!#REF!","v":{"$error":"#REF!"}},{"$f":"IF(ISERROR(L68),\"\",COUNTIF(partije!$S$2:$S$199,L68))","v":""},""]
[{"$nulls":8},{"$f":"plasman!#REF!","v":{"$error":"#REF!"}},{"$f":"IF(ISERROR(L69),\"\",COUNTIF(partije!$S$2:$S$199,I69))","v":""},{"$error":"#VALUE!"},{"$f":"plasman!#REF!","v":{"$error":"#REF!"}},{"$f":"IF(ISERROR(L69),\"\",COUNTIF(partije!$S$2:$S$199,L69))","v":""},""]
[{"$nulls":8},{"$f":"plasman!#REF!","v":{"$error":"#REF!"}},{"$f":"IF(ISERROR(L70),\"\",COUNTIF(partije!$S$2:$S$199,I70))","v":""},{"$error":"#VALUE!"},{"$f":"plasman!#REF!","v":{"$error":"#REF!"}},{"$f":"IF(ISERROR(L70),\"\",COUNTIF(partije!$S$2:$S$199,L70))","v":""},""]
[{"$nulls":8},{"$f":"plasman!#REF!","v":{"$error":"#REF!"}},{"$f":"IF(ISERROR(L71),\"\",COUNTIF(partije!$S$2:$S$199,I71))","v":""},{"$error":"#VALUE!"},{"$f":"plasman!#REF!","v":{"$error":"#REF!"}},{"$f":"IF(ISERROR(L71),\"\",COUNTIF(partije!$S$2:$S$199,L71))","v":""},""]
[{"$nulls":8},{"$f":"plasman!#REF!","v":{"$error":"#REF!"}},{"$f":"IF(ISERROR(L72),\"\",COUNTIF(partije!$S$2:$S$199,I72))","v":""},{"$error":"#VALUE!"},{"$f":"plasman!#REF!","v":{"$error":"#REF!"}},{"$f":"IF(ISERROR(L72),\"\",COUNTIF(partije!$S$2:$S$199,L72))","v":""},""]
[{"$nulls":8},{"$f":"plasman!#REF!","v":{"$error":"#REF!"}},{"$f":"IF(ISERROR(L73),\"\",COUNTIF(partije!$S$2:$S$199,I73))","v":""},{"$error":"#VALUE!"},{"$f":"plasman!#REF!","v":{"$error":"#REF!"}},{"$f":"IF(ISERROR(L73),\"\",COUNTIF(partije!$S$2:$S$199,L73))","v":""},""]
[{"$nulls":8},{"$f":"plasman!#REF!","v":{"$error":"#REF!"}},{"$f":"IF(ISERROR(L74),\"\",COUNTIF(partije!$S$2:$S$199,I74))","v":""},{"$error":"#VALUE!"},{"$f":"plasman!#REF!","v":{"$error":"#REF!"}},{"$f":"IF(ISERROR(L74),\"\",COUNTIF(partije!$S$2:$S$199,L74))","v":""},""]
[{"$nulls":8},{"$f":"plasman!#REF!","v":{"$error":"#REF!"}},{"$f":"IF(ISERROR(L75),\"\",COUNTIF(partije!$S$2:$S$199,I75))","v":""},{"$error":"#VALUE!"},{"$f":"plasman!#REF!","v":{"$error":"#REF!"}},{"$f":"IF(ISERROR(L75),\"\",COUNTIF(partije!$S$2:$S$199,L75))","v":""},""]

{"sheet":"razigravanje","index":7,"n_rows":60,"n_cols":39,"rows_kept":60,"hidden":true,"merged":[[2,9,2,15],[2,16,2,22],[2,26,2,31],[2,32,2,37],[3,2,3,8],[3,9,4,13],[3,14,4,14],[3,15,4,15],[3,24,4,24],[3,25,4,29],[3,30,4,30],[3,31,4,31],[4,0,5,0],[4,1,5,1],[4,2,5,8],[5,9,6,9],[5,10,6,10],[5,11,6,11],[5,12,6,12],[5,13,6,13],[5,14,6,14],[5,15,6,15],[5,16,6,20],[5,21,6,21],[5,22,6,22],[5,25,6,25],[5,26,6,26],[5,27,6,27],[5,28,6,28],[5,29,6,29],[5,30,6,30],[5,31,6,31],[5,32,6,36],[5,37,6,37],[5,38,6,38],[6,0,7,0],[6,1,7,1],[6,2,7,8],[7,9,8,13],[7,14,8,14],[7,15,8,15],[7,16,8,16],[7,17,8,17],[7,18,8,18],[7,19,8,19],[7,20,8,20],[7,21,8,21],[7,22,8,22],[7,24,8,24],[7,25,8,29],[7,30,8,30],[7,31,8,31],[7,32,8,32],[7,33,8,33],[7,34,8,34],[7,35,8,35],[7,36,8,36],[7,37,8,37],[7,38,8,38],[8,0,9,0],[8,1,9,1],[8,2,9,8],[9,9,10,9],[9,10,10,10],[9,11,10,11],[9,12,10,12],[9,13,10,13],[9,14,10,14],[9,15,10,15],[9,25,10,25],[9,26,10,26],[9,27,10,27],[9,28,10,28],[9,29,10,29],[9,30,10,30],[9,31,10,31],[10,0,11,0],[10,1,11,1],[10,2,11,8],[11,9,12,13],[11,14,12,14],[11,15,12,15],[11,24,12,24],[11,25,12,29],[11,30,12,30],[11,31,12,31],[12,0,13,0],[12,1,13,1],[12,2,13,8],[13,9,14,9],[13,10,14,10],[13,11,14,11],[13,12,14,12],[13,13,14,13],[13,14,14,14],[13,15,14,15],[13,16,14,20],[13,21,14,21],[13,22,14,22],[13,25,14,25],[13,26,14,26],[13,27,14,27],[13,28,14,28],[13,29,14,29],[13,30,14,30],[13,31,14,31],[13,32,14,36],[13,37,14,37],[13,38,14,38],[14,0,15,0],[14,1,15,1],[14,2,15,8],[15,9,16,13],[15,14,16,14],[15,15,16,15],[15,16,16,16],[15,17,16,17],[15,18,16,18],[15,19,16,19],[15,20,16,20],[15,21,16,21],[15,22,16,22],[15,24,16,24],[15,25,16,29],[15,30,16,30],[15,31,16,31],[15,32,16,32],[15,33,16,33],[15,34,16,34],[15,35,16,35],[15,36,16,36],[15,37,16,37],[15,38,16,38],[16,0,17,0],[16,1,17,1],[16,2,17,8],[17,9,18,9],[17,10,18,10],[17,11,18,11],[17,12,18,12],[17,13,18,13],[17,14,18,14],[17,15,18,15],[17,25,18,25],[17,26,18,26],[17,27,18,27],[17,28,18,28],[17,29,18,29],[17,30,18,30],[17,31,18,31],[18,0,19,0],[18,1,19,1],[18,2,19,8],[19,9,20,13],[19,14,20,14],[19,15,20,15],[19,24,20,24],[19,25,20,29],[19,30,20,30],[19,31,20,31],[20,0,21,0],[20,1,21,1],[20,2,21,8],[21,9,22,9],[21,10,22,10],[21,11,22,11],[21,12,22,12],[21,13,22,13],[21,14,22,14],[21,15,22,15],[21,16,22,20],[21,21,22,21],[21,22,22,22],[21,25,22,25],[21,26,22,26],[21,27,22,27],[21,28,22,28],[21,29,22,29],[21,30,22,30],[21,31,22,31],[21,32,22,36],[21,37,22,37],[21,38,22,38],[22,0,23,0],[22,1,23,1],[22,2,23,8],[23,9,24,13],[23,14,24,14],[23,15,24,15],[23,16,24,16],[23,17,24,17],[23,18,24,18],[23,19,24,19],[23,20,24,20],[23,21,24,21],[23,22,24,22],[23,24,24,24],[23,25,24,29],[23,30,24,30],[23,31,24,31],[23,32,24,32],[23,33,24,33],[23,34,24,34],[23,35,24,35],[23,36,24,36],[23,37,24,37],[23,38,24,38],[24,0,25,0],[24,1,25,1],[24,2,25,8],[25,9,26,9],[25,10,26,10],[25,11,26,11],[25,12,26,12],[25,13,26,13],[25,14,26,14],[25,15,26,15],[25,25,26,25],[25,26,26,26],[25,27,26,27],[25,28,26,28],[25,29,26,29],[25,30,26,30],[25,31,26,31],[26,0,27,0],[26,1,27,1],[26,2,27,8],[27,9,28,13],[27,14,28,14],[27,15,28,15],[27,24,28,24],[27,25,28,29],[27,30,28,30],[27,31,28,31],[28,0,29,0],[28,1,29,1],[28,2,29,8],[29,9,30,9],[29,10,30,10],[29,11,30,11],[29,12,30,12],[29,13,30,13],[29,14,30,14],[29,15,30,15],[29,16,30,20],[29,21,30,21],[29,22,30,22],[29,25,30,25],[29,26,30,26],[29,27,30,27],[29,28,30,28],[29,29,30,29],[29,30,30,30],[29,31,30,31],[29,32,30,36],[29,37,30,37],[29,38,30,38],[30,0,31,0],[30,1,31,1],[30,2,31,8],[31,9,32,13],[31,14,32,14],[31,15,32,15],[31,16,32,16],[31,17,32,17],[31,18,32,18],[31,19,32,19],[31,20,32,20],[31,21,32,21],[31,22,32,22],[31,24,32,24],[31,25,32,29],[31,30,32,30],[31,31,32,31],[31,32,32,32],[31,33,32,33],[31,34,32,34],[31,35,32,35],[31,36,32,36],[31,37,32,37],[31,38,32,38],[32,0,33,0],[32,1,33,1],[32,2,33,8],[33,9,34,9],[33,10,34,10],[33,11,34,11],[33,12,34,12],[33,13,34,13],[33,14,34,14],[33,15,34,15],[33,25,34,25],[33,26,34,26],[33,27,34,27],[33,28,34,28],[33,29,34,29],[33,30,34,30],[33,31,34,31],[34,0,35,0],[34,1,35,1],[34,2,35,6],[34,7,35,7],[34,8,35,8],[35,9,35,13],[36,33,37,35],[36,36,37,37],[37,2,38,2],[37,3,38,8],[37,9,38,15],[38,33,39,35],[38,36,39,37],[40,0,41,0],[40,2,41,8],[40,33,41,35],[40,36,41,37],[41,9,42,13],[41,14,42,14],[41,15,42,15],[42,0,43,0],[42,2,43,8],[42,33,43,35],[42,36,43,37],[43,9,44,9],[43,10,44,10],[43,11,44,11],[43,12,44,12],[43,13,44,13],[43,14,44,14],[43,15,44,15],[44,0,45,0],[44,2,45,8],[44,33,45,36],[44,37,45,38],[45,9,46,13],[45,14,46,14],[45,15,46,15],[46,0,47,0],[46,2,47,8],[46,33,47,36],[46,37,47,38],[47,9,48,9],[47,10,48,10],[47,11,48,11],[47,12,48,12],[47,13,48,13],[47,14,48,14],[47,15,48,15],[48,0,49,0],[48,2,49,8],[48,33,49,36],[48,37,49,38],[49,9,50,13],[49,14,50,14],[49,15,50,15],[50,0,51,0],[50,2,51,8],[50,33,51,36],[50,37,51,38],[51,9,52,9],[51,10,52,10],[51,11,52,11],[51,12,52,12],[51,13,52,13],[51,14,52,14],[51,15,52,15],[51,17,52,32],[52,0,53,0],[52,2,53,8],[52,33,53,36],[52,37,53,38],[53,9,54,13],[53,14,54,14],[53,15,54,15],[53,17,54,32],[54,0,55,0],[54,2,55,8],[54,33,55,36],[54,37,55,38],[55,9,56,9],[55,10,56,10],[55,11,56,11],[55,12,56,12],[55,13,56,13],[55,14,56,14],[55,15,56,15],[55,17,56,32],[56,33,57,36],[56,37,57,38]]}
[{"$f":"info!C3","v":"Otvoreno prvenstvo RSTSN"},{"$nulls":37},{"$f":"info!C4","v":"mlađi kadeti"}]
[]
[null,null,"R1",{"$nulls":6},"21.-24. mesto",{"$nulls":6},"17.-20. mesto",{"$nulls":8},"R2","29.-32. mesto",{"$nulls":5},"25.-28. mesto"]
[1,null,{"$f":"IF(ISBLANK(partije!J200),\"\",IF(partije!J200<partije!K200,partije!F200,partije!H200))","v":"Putnik Dario"},{"$nulls":6},{"$f":"IF(ISBLANK(partije!J263),\"\",IF(partije!J263>partije!K263,partije!F263,partije!H263))","v":""},{"$nulls":4},{"$f":"IF(ISBLANK(partije!J263),\"\",IF(partije!J263>partije!K263,partije!J263,partije!K263))","v":""},{"$f":"IF(ISBLANK(partije!J263),\"\",IF(partije!J263>partije!K263,partije!K263,partije!J263))","v":""},{"$nulls":8},1,{"$f":"IF(ISBLANK(partije!J263),\"\",IF(partije!J263<partije!K263,partije!F263,partije!H263))","v":""}]
[2,null,{"$f":"IF(ISBLANK(partije!J201),\"\",IF(partije!J201<partije!K201,partije!F201,partije!H201))","v":"Rajić Borislav"}]
[{"$nulls":9},{"$f":"IF(ISBLANK(partije!L263),\"\",partije!L263)","v":""},{"$f":"IF(ISBLANK(partije!M263),\"\",partije!M263)","v":""},{"$f":"IF(ISBLANK(partije!N263),\"\",partije!N263)","v":""},{"$f":"IF(ISBLANK(partije!O263),\"\",partije!O263)","v":""},{"$f":"IF(ISBLANK(partije!P263),\"\",partije!P263)","v":""},{"$f":"IF(ISBLANK(partije!Q263),\"\",partije!Q263)","v":""},{"$f":"IF(ISBLANK(partije!R263),\"\",partije!R263)","v":""},{"$f":"IF(ISBLANK(partije!J275),\"\",IF(partije!J275>partije!K275,partije!F275,partije!H275))","v":""},{"$nulls":4},{"$f":"IF(ISBLANK(partije!J275),\"\",IF(partije!J275>partije!K275,partije!J275,partije!K275))","v":""},{"$f":"IF(ISBLANK(partije!J275),\"\",IF(partije!J275>partije!K275,partije!K275,partije!J275))","v":""},{"$nulls":9},{"$f":"IF(ISBLANK(partije!J279),\"\",IF(partije!J279>partije!K279,partije!F279,partije!H279))","v":""},{"$nulls":4},{"$f":"IF(ISBLANK(partije!J279),\"\",IF(partije!J279>partije!K279,partije!J279,partije!K279))","v":""},{"$f":"IF(ISBLANK(partije!J279),\"\",IF(partije!J279>partije!K279,partije!K279,partije!J279))","v":""}]
[3,null,{"$f":"IF(ISBLANK(partije!J202),\"\",IF(partije!J202<partije!K202,partije!F202,partije!H202))","v":"Stefanović Luka"}]
[{"$nulls":9},{"$f":"IF(ISBLANK(partije!J264),\"\",IF(partije!J264>partije!K264,partije!F264,partije!H264))","v":""},{"$nulls":4},{"$f":"IF(ISBLANK(partije!J264),\"\",IF(partije!J264>partije!K264,partije!J264,partije!K264))","v":""},{"$f":"IF(ISBLANK(partije!J264),\"\",IF(partije!J264>partije!K264,partije!K264,partije!J264))","v":""},{"$f":"IF(ISBLANK(partije!L275),\"\",partije!L275)","v":""},{"$f":"IF(ISBLANK(partije!M275),\"\",partije!M275)","v":""},{"$f":"IF(ISBLANK(partije!N275),\"\",partije!N275)","v":""},{"$f":"IF(ISBLANK(partije!O275),\"\",partije!O275)","v":""},{"$f":"IF(ISBLANK(partije!P275),\"\",partije!P275)","v":""},{"$f":"IF(ISBLANK(partije!Q275),\"\",partije!Q275)","v":""},{"$f":"IF(ISBLANK(partije!R275),\"\",partije!R275)","v":""},null,2,{"$f":"IF(ISBLANK(partije!J264),\"\",IF(partije!J264<partije!K264,partije!F264,partije!H264))","v":""},{"$nulls":6},{"$f":"IF(ISBLANK(partije!L279),\"\",partije!L279)","v":""},{"$f":"IF(ISBLANK(partije!M279),\"\",partije!M279)","v":""},{"$f":"IF(ISBLANK(partije!N279),\"\",partije!N279)","v":""},{"$f":"IF(ISBLANK(partije!O279),\"\",partije!O279)","v":""},{"$f":"IF(ISBLANK(partije!P279),\"\",partije!P279)","v":""},{"$f":"IF(ISBLANK(partije!Q279),\"\",partije!Q279)","v":""},{"$f":"IF(ISBLANK(partije!R279),\"\",partije!R279)","v":""}]
[4,null,{"$f":"IF(ISBLANK(partije!J203),\"\",IF(partije!J203<partije!K203,partije!F203,partije!H203))","v":"Vasić Bogdan"}]
[{"$nulls":9},{"$f":"IF(ISBLANK(partije!L264),\"\",partije!L264)","v":""},{"$f":"IF(ISBLANK(partije!M264),\"\",partije!M264)","v":""},{"$f":"IF(ISBLANK(partije!N264),\"\",partije!N264)","v":""},{"$f":"IF(ISBLANK(partije!O264),\"\",partije!O264)","v":""},{"$f":"IF(ISBLANK(partije!P264),\"\",partije!P264)","v":""},{"$f":"IF(ISBLANK(partije!Q264),\"\",partije!Q264)","v":""},{"$f":"IF(ISBLANK(partije!R264),\"\",partije!R264)","v":""}]
[5,null,{"$f":"IF(ISBLANK(partije!J204),\"\",IF(partije!J204<partije!K204,partije!F204,partije!H204))","v":"Marković Jovan"}]
[{"$nulls":9},{"$f":"IF(ISBLANK(partije!J265),\"\",IF(partije!J265>partije!K265,partije!F265,partije!H265))","v":""},{"$nulls":4},{"$f":"IF(ISBLANK(partije!J265),\"\",IF(partije!J265>partije!K265,partije!J265,partije!K265))","v":""},{"$f":"IF(ISBLANK(partije!J265),\"\",IF(partije!J265>partije!K265,partije!K265,partije!J265))","v":""},{"$nulls":8},3,{"$f":"IF(ISBLANK(partije!J265),\"\",IF(partije!J265<partije!K265,partije!F265,partije!H265))","v":""}]
[6,null,{"$f":"IF(ISBLANK(partije!J205),\"\",IF(partije!J205<partije!K205,partije!F205,partije!H205))","v":"Kalinčević Vladimir"}]
[{"$nulls":9},{"$f":"IF(ISBLANK(partije!L265),\"\",partije!L265)","v":""},{"$f":"IF(ISBLANK(partije!M265),\"\",partije!M265)","v":""},{"$f":"IF(ISBLANK(partije!N265),\"\",partije!N265)","v":""},{"$f":"IF(ISBLANK(partije!O265),\"\",partije!O265)","v":""},{"$f":"IF(ISBLANK(partije!P265),\"\",partije!P265)","v":""},{"$f":"IF(ISBLANK(partije!Q265),\"\",partije!Q265)","v":""},{"$f":"IF(ISBLANK(partije!R265),\"\",partije!R265)","v":""},{"$f":"IF(ISBLANK(partije!J276),\"\",IF(partije!J276>partije!K276,partije!F276,partije!H276))","v":""},{"$nulls":4},{"$f":"IF(ISBLANK(partije!J276),\"\",IF(partije!J276>partije!K276,partije!J276,partije!K276))","v":""},{"$f":"IF(ISBLANK(partije!J276),\"\",IF(partije!J276>partije!K276,partije!K276,partije!J276))","v":""},{"$nulls":9},{"$f":"IF(ISBLANK(partije!J280),\"\",IF(partije!J280>partije!K280,partije!F280,partije!H280))","v":""},{"$nulls":4},{"$f":"IF(ISBLANK(partije!J280),\"\",IF(partije!J280>partije!K280,partije!J280,partije!K280))","v":""},{"$f":"IF(ISBLANK(partije!J280),\"\",IF(partije!J280>partije!K280,partije!K280,partije!J280))","v":""}]
[7,null,{"$f":"IF(ISBLANK(partije!J206),\"\",IF(partije!J206<partije!K206,partije!F206,partije!H206))","v":"Mladenović Ognjen"}]
[{"$nulls":9},{"$f":"IF(ISBLANK(partije!J266),\"\",IF(partije!J266>partije!K266,partije!F266,partije!H266))","v":""},{"$nulls":4},{"$f":"IF(ISBLANK(partije!J266),\"\",IF(partije!J266>partije!K266,partije!J266,partije!K266))","v":""},{"$f":"IF(ISBLANK(partije!J266),\"\",IF(partije!J266>partije!K266,partije!K266,partije!J266))","v":""},{"$f":"IF(ISBLANK(partije!L276),\"\",partije!L276)","v":""},{"$f":"IF(ISBLANK(partije!M276),\"\",partije!M276)","v":""},{"$f":"IF(ISBLANK(partije!N276),\"\",partije!N276)","v":""},{"$f":"IF(ISBLANK(partije!O276),\"\",partije!O276)","v":""},{"$f":"IF(ISBLANK(partije!P276),\"\",partije!P276)","v":""},{"$f":"IF(ISBLANK(partije!Q276),\"\",partije!Q276)","v":""},{"$f":"IF(ISBLANK(partije!R276),\"\",partije!R276)","v":""},null,4,{"$f":"IF(ISBLANK(partije!J266),\"\",IF(partije!J266<partije!K266,partije!F266,partije!H266))","v":""},{"$nulls":6},{"$f":"IF(ISBLANK(partije!L280),\"\",partije!L280)","v":""},{"$f":"IF(ISBLANK(partije!M280),\"\",partije!M280)","v":""},{"$f":"IF(ISBLANK(partije!N280),\"\",partije!N280)","v":""},{"$f":"IF(ISBLANK(partije!O280),\"\",partije!O280)","v":""},{"$f":"IF(ISBLANK(partije!P280),\"\",partije!P280)","v":""},{"$f":"IF(ISBLANK(partije!Q280),\"\",partije!Q280)","v":""},{"$f":"IF(ISBLANK(partije!R280),\"\",partije!R280)","v":""}]
[8,null,{"$f":"IF(ISBLANK(partije!J207),\"\",IF(partije!J207<partije!K207,partije!F207,partije!H207))","v":"Velinović Miloš"}]
[{"$nulls":9},{"$f":"IF(ISBLANK(partije!L266),\"\",partije!L266)","v":""},{"$f":"IF(ISBLANK(partije!M266),\"\",partije!M266)","v":""},{"$f":"IF(ISBLANK(partije!N266),\"\",partije!N266)","v":""},{"$f":"IF(ISBLANK(partije!O266),\"\",partije!O266)","v":""},{"$f":"IF(ISBLANK(partije!P266),\"\",partije!P266)","v":""},{"$f":"IF(ISBLANK(partije!Q266),\"\",partije!Q266)","v":""},{"$f":"IF(ISBLANK(partije!R266),\"\",partije!R266)","v":""}]
[9,null,{"$f":"IF(ISBLANK(partije!J208),\"\",IF(partije!J208<partije!K208,partije!F208,partije!H208))","v":"Preslav Nikolov"}]
[{"$nulls":9},{"$f":"IF(ISBLANK(partije!J267),\"\",IF(partije!J267>partije!K267,partije!F267,partije!H267))","v":""},{"$nulls":4},{"$f":"IF(ISBLANK(partije!J267),\"\",IF(partije!J267>partije!K267,partije!J267,partije!K267))","v":""},{"$f":"IF(ISBLANK(partije!J267),\"\",IF(partije!J267>partije!K267,partije!K267,partije!J267))","v":""},{"$nulls":8},5,{"$f":"IF(ISBLANK(partije!J267),\"\",IF(partije!J267<partije!K267,partije!F267,partije!H267))","v":""}]
[10,null,{"$f":"IF(ISBLANK(partije!J209),\"\",IF(partije!J209<partije!K209,partije!F209,partije!H209))","v":"Dragin Saša"}]
[{"$nulls":9},{"$f":"IF(ISBLANK(partije!L267),\"\",partije!L267)","v":""},{"$f":"IF(ISBLANK(partije!M267),\"\",partije!M267)","v":""},{"$f":"IF(ISBLANK(partije!N267),\"\",partije!N267)","v":""},{"$f":"IF(ISBLANK(partije!O267),\"\",partije!O267)","v":""},{"$f":"IF(ISBLANK(partije!P267),\"\",partije!P267)","v":""},{"$f":"IF(ISBLANK(partije!Q267),\"\",partije!Q267)","v":""},{"$f":"IF(ISBLANK(partije!R267),\"\",partije!R267)","v":""},{"$f":"IF(ISBLANK(partije!J277),\"\",IF(partije!J277>partije!K277,partije!F277,partije!H277))","v":""},{"$nulls":4},{"$f":"IF(ISBLANK(partije!J277),\"\",IF(partije!J277>partije!K277,partije!J277,partije!K277))","v":""},{"$f":"IF(ISBLANK(partije!J277),\"\",IF(partije!J277>partije!K277,partije!K277,partije!J277))","v":""},{"$nulls":9},{"$f":"IF(ISBLANK(partije!J281),\"\",IF(partije!J281>partije!K281,partije!F281,partije!H281))","v":""},{"$nulls":4},{"$f":"IF(ISBLANK(partije!J281),\"\",IF(partije!J281>partije!K281,partije!J281,partije!K281))","v":""},{"$f":"IF(ISBLANK(partije!J281),\"\",IF(partije!J281>partije!K281,partije!K281,partije!J281))","v":""}]
[11,null,{"$f":"IF(ISBLANK(partije!J210),\"\",IF(partije!J210<partije!K210,partije!F210,partije!H210))","v":"Zaharijev  Nikola"}]
[{"$nulls":9},{"$f":"IF(ISBLANK(partije!J268),\"\",IF(partije!J268>partije!K268,partije!F268,partije!H268))","v":""},{"$nulls":4},{"$f":"IF(ISBLANK(partije!J268),\"\",IF(partije!J268>partije!K268,partije!J268,partije!K268))","v":""},{"$f":"IF(ISBLANK(partije!J268),\"\",IF(partije!J268>partije!K268,partije!K268,partije!J268))","v":""},{"$f":"IF(ISBLANK(partije!L277),\"\",partije!L277)","v":""},{"$f":"IF(ISBLANK(partije!M277),\"\",partije!M277)","v":""},{"$f":"IF(ISBLANK(partije!N277),\"\",partije!N277)","v":""},{"$f":"IF(ISBLANK(partije!O277),\"\",partije!O277)","v":""},{"$f":"IF(ISBLANK(partije!P277),\"\",partije!P277)","v":""},{"$f":"IF(ISBLANK(partije!Q277),\"\",partije!Q277)","v":""},{"$f":"IF(ISBLANK(partije!R277),\"\",partije!R277)","v":""},null,6,{"$f":"IF(ISBLANK(partije!J268),\"\",IF(partije!J268<partije!K268,partije!F268,partije!H268))","v":""},{"$nulls":6},{"$f":"IF(ISBLANK(partije!L281),\"\",partije!L281)","v":""},{"$f":"IF(ISBLANK(partije!M281),\"\",partije!M281)","v":""},{"$f":"IF(ISBLANK(partije!N281),\"\",partije!N281)","v":""},{"$f":"IF(ISBLANK(partije!O281),\"\",partije!O281)","v":""},{"$f":"IF(ISBLANK(partije!P281),\"\",partije!P281)","v":""},{"$f":"IF(ISBLANK(partije!Q281),\"\",partije!Q281)","v":""},{"$f":"IF(ISBLANK(partije!R281),\"\",partije!R281)","v":""}]
[12,null,{"$f":"IF(ISBLANK(partije!J211),\"\",IF(partije!J211<partije!K211,partije!F211,partije!H211))","v":"Jovanović Đurađ"}]
[{"$nulls":9},{"$f":"IF(ISBLANK(partije!L268),\"\",partije!L268)","v":""},{"$f":"IF(ISBLANK(partije!M268),\"\",partije!M268)","v":""},{"$f":"IF(ISBLANK(partije!N268),\"\",partije!N268)","v":""},{"$f":"IF(ISBLANK(partije!O268),\"\",partije!O268)","v":""},{"$f":"IF(ISBLANK(partije!P268),\"\",partije!P268)","v":""},{"$f":"IF(ISBLANK(partije!Q268),\"\",partije!Q268)","v":""},{"$f":"IF(ISBLANK(partije!R268),\"\",partije!R268)","v":""}]
[13,null,{"$f":"IF(ISBLANK(partije!J212),\"\",IF(partije!J212<partije!K212,partije!F212,partije!H212))","v":"Pucarević Pavle"}]
[{"$nulls":9},{"$f":"IF(ISBLANK(partije!J269),\"\",IF(partije!J269>partije!K269,partije!F269,partije!H269))","v":""},{"$nulls":4},{"$f":"IF(ISBLANK(partije!J269),\"\",IF(partije!J269>partije!K269,partije!J269,partije!K269))","v":""},{"$f":"IF(ISBLANK(partije!J263),\"\",IF(partije!J263>partije!K263,partije!K263,partije!J263))","v":""},{"$nulls":8},7,{"$f":"IF(ISBLANK(partije!J269),\"\",IF(partije!J269<partije!K269,partije!F269,partije!H269))","v":""}]
[14,null,{"$f":"IF(ISBLANK(partije!J213),\"\",IF(partije!J213<partije!K213,partije!F213,partije!H213))","v":"Marinković Vasilije"}]
[{"$nulls":9},{"$f":"IF(ISBLANK(partije!L269),\"\",partije!L269)","v":""},{"$f":"IF(ISBLANK(partije!M269),\"\",partije!M269)","v":""},{"$f":"IF(ISBLANK(partije!N269),\"\",partije!N269)","v":""},{"$f":"IF(ISBLANK(partije!O269),\"\",partije!O269)","v":""},{"$f":"IF(ISBLANK(partije!P269),\"\",partije!P269)","v":""},{"$f":"IF(ISBLANK(partije!Q269),\"\",partije!Q269)","v":""},{"$f":"IF(ISBLANK(partije!R269),\"\",partije!R269)","v":""},{"$f":"IF(ISBLANK(partije!J278),\"\",IF(partije!J278>partije!K278,partije!F278,partije!H278))","v":""},{"$nulls":4},{"$f":"IF(ISBLANK(partije!J278),\"\",IF(partije!J278>partije!K278,partije!J278,partije!K278))","v":""},{"$f":"IF(ISBLANK(partije!J278),\"\",IF(partije!J278>partije!K278,partije!K278,partije!J278))","v":""},{"$nulls":9},{"$f":"IF(ISBLANK(partije!J282),\"\",IF(partije!J282>partije!K282,partije!F282,partije!H282))","v":""},{"$nulls":4},{"$f":"IF(ISBLANK(partije!J282),\"\",IF(partije!J282>partije!K282,partije!J282,partije!K282))","v":""},{"$f":"IF(ISBLANK(partije!J282),\"\",IF(partije!J282>partije!K282,partije!K282,partije!J282))","v":""}]
[15,null,{"$f":"IF(ISBLANK(partije!J214),\"\",IF(partije!J214<partije!K214,partije!F214,partije!H214))","v":"Konstantinov Marko"}]
[{"$nulls":9},{"$f":"IF(ISBLANK(partije!J270),\"\",IF(partije!J270>partije!K270,partije!F270,partije!H270))","v":""},{"$nulls":4},{"$f":"IF(ISBLANK(partije!J270),\"\",IF(partije!J270>partije!K270,partije!J270,partije!K270))","v":""},{"$f":"IF(ISBLANK(partije!J270),\"\",IF(partije!J270>partije!K270,partije!K270,partije!J270))","v":""},{"$f":"IF(ISBLANK(partije!L278),\"\",partije!L278)","v":""},{"$f":"IF(ISBLANK(partije!M278),\"\",partije!M278)","v":""},{"$f":"IF(ISBLANK(partije!N278),\"\",partije!N278)","v":""},{"$f":"IF(ISBLANK(partije!O278),\"\",partije!O278)","v":""},{"$f":"IF(ISBLANK(partije!P278),\"\",partije!P278)","v":""},{"$f":"IF(ISBLANK(partije!Q278),\"\",partije!Q278)","v":""},{"$f":"IF(ISBLANK(partije!R278),\"\",partije!R278)","v":""},null,8,{"$f":"IF(ISBLANK(partije!J270),\"\",IF(partije!J270<partije!K270,partije!F270,partije!H270))","v":""},{"$nulls":6},{"$f":"IF(ISBLANK(partije!L282),\"\",partije!L282)","v":""},{"$f":"IF(ISBLANK(partije!M282),\"\",partije!M282)","v":""},{"$f":"IF(ISBLANK(partije!N282),\"\",partije!N282)","v":""},{"$f":"IF(ISBLANK(partije!O282),\"\",partije!O282)","v":""},{"$f":"IF(ISBLANK(partije!P282),\"\",partije!P282)","v":""},{"$f":"IF(ISBLANK(partije!Q282),\"\",partije!Q282)","v":""},{"$f":"IF(ISBLANK(partije!R282),\"\",partije!R282)","v":""}]
[16,null,{"$f":"IF(ISBLANK(partije!J215),\"\",IF(partije!J215<partije!K215,partije!F215,partije!H215))","v":"Miovčić Mihailo"}]
[{"$nulls":9},{"$f":"IF(ISBLANK(partije!L270),\"\",partije!L270)","v":""},{"$f":"IF(ISBLANK(partije!M270),\"\",partije!M270)","v":""},{"$f":"IF(ISBLANK(partije!N270),\"\",partije!N270)","v":""},{"$f":"IF(ISBLANK(partije!O270),\"\",partije!O270)","v":""},{"$f":"IF(ISBLANK(partije!P270),\"\",partije!P270)","v":""},{"$f":"IF(ISBLANK(partije!Q270),\"\",partije!Q270)","v":""},{"$f":"IF(ISBLANK(partije!R270),\"\",partije!R270)","v":""}]
[]
[]
[]
[null,null,"R3","13.-16. mesto",{"$nulls":5},"9.-12. mesto"]
[]
[]
[1,null,{"$f":"IF(ISBLANK(partije!J216),\"\",IF(partije!J216<partije!K216,partije!F216,partije!H216))","v":"Pavković Đorđe"}]
[{"$nulls":9},{"$f":"IF(ISBLANK(partije!J271),\"\",IF(partije!J271>partije!K271,partije!F271,partije!H271))","v":""},{"$nulls":4},{"$f":"IF(ISBLANK(partije!J271),\"\",IF(partije!J271>partije!K271,partije!J271,partije!K271))","v":""},{"$f":"IF(ISBLANK(partije!J271),\"\",IF(partije!J271>partije!K271,partije!K271,partije!J271))","v":""}]
[2,null,{"$f":"IF(ISBLANK(partije!J217),\"\",IF(partije!J217<partije!K217,partije!F217,partije!H217))","v":"Miljuš Luka"}]
[{"$nulls":9},{"$f":"IF(ISBLANK(partije!L271),\"\",partije!L271)","v":""},{"$f":"IF(ISBLANK(partije!M271),\"\",partije!M271)","v":""},{"$f":"IF(ISBLANK(partije!N271),\"\",partije!N271)","v":""},{"$f":"IF(ISBLANK(partije!O271),\"\",partije!O271)","v":""},{"$f":"IF(ISBLANK(partije!P271),\"\",partije!P271)","v":""},{"$f":"IF(ISBLANK(partije!Q271),\"\",partije!Q271)","v":""},{"$f":"IF(ISBLANK(partije!R271),\"\",partije!R271)","v":""}]
[3,null,{"$f":"IF(ISBLANK(partije!J218),\"\",IF(partije!J218<partije!K218,partije!F218,partije!H218))","v":"Varga Danijel"}]
[{"$nulls":9},{"$f":"IF(ISBLANK(partije!J272),\"\",IF(partije!J272>partije!K272,partije!F272,partije!H272))","v":""},{"$nulls":4},{"$f":"IF(ISBLANK(partije!J272),\"\",IF(partije!J272>partije!K272,partije!J272,partije!K272))","v":""},{"$f":"IF(ISBLANK(partije!J272),\"\",IF(partije!J272>partije!K272,partije!K272,partije!J272))","v":""}]
[4,null,{"$f":"IF(ISBLANK(partije!J219),\"\",IF(partije!J219<partije!K219,partije!F219,partije!H219))","v":"Paunović Petar"}]
[{"$nulls":9},{"$f":"IF(ISBLANK(partije!L272),\"\",partije!L272)","v":""},{"$f":"IF(ISBLANK(partije!M272),\"\",partije!M272)","v":""},{"$f":"IF(ISBLANK(partije!N272),\"\",partije!N272)","v":""},{"$f":"IF(ISBLANK(partije!O272),\"\",partije!O272)","v":""},{"$f":"IF(ISBLANK(partije!P272),\"\",partije!P272)","v":""},{"$f":"IF(ISBLANK(partije!Q272),\"\",partije!Q272)","v":""},{"$f":"IF(ISBLANK(partije!R272),\"\",partije!R272)","v":""}]
[5,null,{"$f":"IF(ISBLANK(partije!J220),\"\",IF(partije!J220<partije!K220,partije!F220,partije!H220))","v":"Radonjić Stefan"}]
[{"$nulls":9},{"$f":"IF(ISBLANK(partije!J273),\"\",IF(partije!J273>partije!K273,partije!F273,partije!H273))","v":""},{"$nulls":4},{"$f":"IF(ISBLANK(partije!J273),\"\",IF(partije!J273>partije!K273,partije!J273,partije!K273))","v":""},{"$f":"IF(ISBLANK(partije!J273),\"\",IF(partije!J273>partije!K273,partije!K273,partije!J273))","v":""}]
[6,null,{"$f":"IF(ISBLANK(partije!J221),\"\",IF(partije!J221<partije!K221,partije!F221,partije!H221))","v":"Jozić Marino"}]
[{"$nulls":9},{"$f":"IF(ISBLANK(partije!L273),\"\",partije!L273)","v":""},{"$f":"IF(ISBLANK(partije!M273),\"\",partije!M273)","v":""},{"$f":"IF(ISBLANK(partije!N273),\"\",partije!N273)","v":""},{"$f":"IF(ISBLANK(partije!O273),\"\",partije!O273)","v":""},{"$f":"IF(ISBLANK(partije!P273),\"\",partije!P273)","v":""},{"$f":"IF(ISBLANK(partije!Q273),\"\",partije!Q273)","v":""},{"$f":"IF(ISBLANK(partije!R273),\"\",partije!R273)","v":""},null,"R1 - igrači koji izgube u 1. kolu glavne table - po redosledu po kojem su u glavnoj tabli"]
[7,null,{"$f":"IF(ISBLANK(partije!J222),\"\",IF(partije!J222<partije!K222,partije!F222,partije!H222))","v":"Rajić Dalibor"}]
[{"$nulls":9},{"$f":"IF(ISBLANK(partije!J274),\"\",IF(partije!J274>partije!K274,partije!F274,partije!H274))","v":""},{"$nulls":4},{"$f":"IF(ISBLANK(partije!J274),\"\",IF(partije!J274>partije!K274,partije!J274,partije!K274))","v":""},{"$f":"IF(ISBLANK(partije!J274),\"\",IF(partije!J274>partije!K274,partije!K274,partije!J274))","v":""},null,"R2 - igrači koji izgube u 1. kolu R1 table - po redosledu po kojem su u R1 tabli"]
[8,null,{"$f":"IF(ISBLANK(partije!J223),\"\",IF(partije!J223<partije!K223,partije!F223,partije!H223))","v":"Gerginov Vanja"}]
[{"$nulls":9},{"$f":"IF(ISBLANK(partije!L274),\"\",partije!L274)","v":""},{"$f":"IF(ISBLANK(partije!M274),\"\",partije!M274)","v":""},{"$f":"IF(ISBLANK(partije!N274),\"\",partije!N274)","v":""},{"$f":"IF(ISBLANK(partije!O274),\"\",partije!O274)","v":""},{"$f":"IF(ISBLANK(partije!P274),\"\",partije!P274)","v":""},{"$f":"IF(ISBLANK(partije!Q274),\"\",partije!Q274)","v":""},{"$f":"IF(ISBLANK(partije!R274),\"\",partije!R274)","v":""},null,"R3 - igrači koji izgube u 2. kolu glavne table - po redosledu po kojem su u glavnoj tabli"]
[]
[]
[]
[{"$f":"CONCATENATE(info!C6,\", \",info!C5)","v":"Niš, 02.2.2019."},{"$nulls":37},{"$f":"info!C7","v":"RSTSN"}]